program: Orca
programVersion: 5.0.2
elementType: O O O C C C C C C C C C C C C C C C C C C C C C C H H H H H H H H H H H H H H H H H H H H H H H H H H
charge: 0
multiplicity: 1
keywords: wb97x-d3
keywords: def2-TZVPP
keywords: def2/J RIJCOSX
keywords: DEFGRID2
keywords: scfconv7
keywords: smallprint printgap noloewdin
keywords: NOSOSCF
formula: C22H26O3
InChI: InChI=1/C22H26O3/c1-15(2)10-19-20(22(19,3)4)21(23)25-14-17-12-18(24-13-17)11-16-8-6-5-7-9-16/h5-10,12-13,19-20H,11,14H2,1-4H3
51 atoms
O  -1.125544 1.498576 1.40567
O  -2.384654 2.533791 -0.120415
O  1.712236 3.328665 -1.485401
C  -2.202806 -0.969677 -0.2431
C  -2.6363 -0.96384 1.195532
C  -2.847269 0.269232 0.357967
C  -0.725776 -0.989484 -0.553778
C  -3.032669 -1.722125 -1.252994
C  -3.822648 -1.73268 1.652922
C  -2.108889 1.540756 0.512466
C  -3.782742 -2.960449 2.177449
C  -5.03278 -3.660435 2.615838
C  -2.51797 -3.740073 2.363287
C  -0.270171 2.647983 1.515237
C  0.688028 2.712613 0.381482
C  1.733602 1.776675 0.09116
C  0.725062 3.625536 -0.615335
C  2.317707 2.194737 -1.055693
C  3.441949 1.664092 -1.875268
C  3.724708 0.22278 -1.544921
C  4.860891 -0.142205 -0.8322
C  2.827969 -0.771215 -1.934141
C  5.101805 -1.474394 -0.515649
C  3.063606 -2.100258 -1.618174
C  4.203836 -2.455967 -0.90666
H  -1.816152 -0.911824 1.905405
H  -3.863256 0.444214 0.017626
H  -0.113956 -0.580176 0.247284
H  -0.39765 -2.018889 -0.713922
H  -0.506387 -0.430833 -1.466205
H  -2.781214 -2.785159 -1.242438
H  -4.10278 -1.634856 -1.066815
H  -2.841331 -1.349502 -2.261509
H  -4.790875 -1.252084 1.542229
H  -5.92388 -3.054625 2.450428
H  -4.991307 -3.914424 3.67864
H  -5.163142 -4.604153 2.079324
H  -1.630349 -3.212949 2.01642
H  -2.57086 -4.68939 1.823242
H  -2.36726 -3.995442 3.415677
H  0.251853 2.504918 2.460565
H  -0.858486 3.563264 1.593847
H  2.000133 0.905016 0.668127
H  0.131284 4.501065 -0.828634
H  4.341152 2.267622 -1.71804
H  3.191511 1.761477 -2.935991
H  5.566416 0.619546 -0.521475
H  1.936599 -0.500645 -2.48893
H  5.993145 -1.742987 0.037277
H  2.359469 -2.861299 -1.930044
H  4.389876 -3.493902 -0.661406
elementType: O C H
totalener: -1079.75110501 hartree
nucrepener: 2148.21690292 hartree
electener: -3227.96800793 hartree
oneelecener: -5735.30618601 hartree
twoeener: 2507.33817808 hartree
cpcmener: -0.02573674 hartree
kineticenergy: 1074.85927668 hartree
xcener: -106.462106897715 hartree
chargesum: -0.0000000
charge: -0.273588 -0.468276 -0.280161 0.166962 0.019059 -0.142425 -0.335115 -0.274654 -0.275178 0.409110 -0.034667 -0.230090 -0.249661 0.067593 -0.066155 -0.364888 -0.020643 0.215167 -0.018922 0.017395 -0.174149 -0.228716 -0.155055 -0.142646 -0.168085 0.103330 0.094323 0.093496 0.100570 0.106338 0.094747 0.092280 0.099954 0.119059 0.088857 0.094276 0.093339 0.086434 0.095377 0.100286 0.117993 0.117449 0.165617 0.172751 0.099075 0.109983 0.138374 0.152877 0.156834 0.157085 0.157079
qa: -0.2736 -0.4683 -0.2802 0.1670 0.0191 -0.1424 -0.3351 -0.2747 -0.2752 0.4091 -0.0347 -0.2301 -0.2497 0.0676 -0.0662 -0.3649 -0.0206 0.2152 -0.0189 0.0174 -0.1741 -0.2287 -0.1551 -0.1426 -0.1681 0.1033 0.0943 0.0935 0.1006 0.1063 0.0947 0.0923 0.1000 0.1191 0.0889 0.0943 0.0933 0.0864 0.0954 0.1003 0.1180 0.1174 0.1656 0.1728 0.0991 0.1100 0.1384 0.1529 0.1568 0.1571 0.1571
va: 2.1179 2.0344 2.2794 3.6871 3.7630 3.8940 3.9043 3.8998 3.8521 4.2057 3.7090 3.9296 3.9395 3.8535 3.6612 3.9580 3.9776 3.6277 3.8155 3.6200 3.9271 3.9265 3.8975 3.8763 3.9047 1.0176 1.0325 1.0057 1.0018 0.9975 1.0017 1.0031 1.0023 1.0080 1.0078 0.9955 0.9964 1.0088 0.9977 0.9987 0.9929 1.0073 0.9990 0.9993 1.0065 1.0074 1.0045 0.9958 0.9908 0.9921 0.9904
dispcorr: -0.025884570 hartree
energy: -1079.776989580016
dipole: -13.76426 14.51848 0.75422 -25.20276 23.85905 -1.34371 5.58109 -4.97950 0.60160
magnitude: 1.65418 au
magnitude: 4.20459 debye
