program: Orca
programVersion: 5.0.2
elementType: O O O C C C C C C C C C C C C C C C C C C C C C C H H H H H H H H H H H H H H H H H H H H H H H H H H
charge: 0
multiplicity: 1
keywords: wb97x-d3
keywords: def2-TZVPP
keywords: def2/J RIJCOSX
keywords: DEFGRID2
keywords: scfconv7
keywords: smallprint printgap noloewdin
keywords: NOSOSCF
formula: C22H26O3
InChI: InChI=1/C22H26O3/c1-15(2)10-19-20(22(19,3)4)21(23)25-14-17-12-18(24-13-17)11-16-8-6-5-7-9-16/h5-10,12-13,19-20H,11,14H2,1-4H3
51 atoms
O  -1.625776 1.796898 0.061046
O  -1.725221 -0.170929 -0.995799
O  2.469506 0.804823 0.517913
C  -4.527108 -0.280471 0.44936
C  -3.541379 -1.157295 1.161541
C  -3.172959 0.276037 0.860841
C  -4.838869 -0.56624 -0.998241
C  -5.710233 0.249813 1.22118
C  -3.732431 -1.5768 2.570701
C  -2.117939 0.570212 -0.12715
C  -4.117359 -2.793248 2.96636
C  -4.271238 -3.122967 4.419986
C  -4.431679 -3.916562 2.026495
C  -0.618282 2.27312 -0.826876
C  0.749324 1.84284 -0.42219
C  1.967606 2.442477 -0.876611
C  1.120636 0.853711 0.422734
C  2.977993 1.772988 -0.273332
C  4.457782 1.895071 -0.354135
C  5.073988 0.838052 -1.239612
C  5.27478 -0.457794 -0.77043
C  5.426128 1.137947 -2.552208
C  5.811868 -1.433352 -1.598775
C  5.968189 0.165199 -3.381473
C  6.159845 -1.125134 -2.90733
H  -3.053984 -1.883718 0.517841
H  -3.203275 0.967742 1.696271
H  -5.703636 -1.230295 -1.059804
H  -5.091277 0.349271 -1.537576
H  -4.020699 -1.052052 -1.525328
H  -6.116437 1.142743 0.74163
H  -6.506789 -0.496595 1.257738
H  -5.459318 0.512632 2.248445
H  -3.546479 -0.824871 3.332601
H  -4.037856 -2.27332 5.061869
H  -3.617651 -3.950894 4.707576
H  -5.291904 -3.444576 4.643739
H  -5.453926 -4.270185 2.184842
H  -3.779594 -4.77431 2.210132
H  -4.338599 -3.64412 0.976692
H  -0.691263 3.360461 -0.787349
H  -0.834856 1.973594 -1.855344
H  2.066267 3.269721 -1.562543
H  0.572617 0.140091 1.017986
H  4.888564 1.842299 0.649545
H  4.691373 2.886088 -0.745253
H  5.014213 -0.708205 0.25127
H  5.277006 2.143567 -2.928132
H  5.962445 -2.436473 -1.220148
H  6.241843 0.417045 -4.398351
H  6.582306 -1.885323 -3.551846
elementType: O C H
totalener: -1079.75281778 hartree
nucrepener: 2029.27881974 hartree
electener: -3109.03163751 hartree
oneelecener: -5497.85921893 hartree
twoeener: 2388.82758142 hartree
cpcmener: -0.02690762 hartree
kineticenergy: 1074.85952311 hartree
xcener: -106.461678614165 hartree
chargesum: -0.0000000
charge: -0.286257 -0.465966 -0.281747 0.148773 -0.006060 -0.125088 -0.296040 -0.264657 -0.262574 0.385777 -0.034165 -0.227011 -0.249737 0.104170 -0.032606 -0.345597 -0.053425 0.218659 -0.068900 0.054974 -0.199825 -0.197226 -0.154296 -0.147710 -0.175801 0.098257 0.088912 0.094917 0.100327 0.093769 0.097868 0.095183 0.089896 0.119439 0.088175 0.094272 0.092967 0.094911 0.097648 0.087764 0.121984 0.114274 0.160182 0.163104 0.116557 0.104672 0.138138 0.139248 0.156455 0.155943 0.157472
qa: -0.2863 -0.4660 -0.2817 0.1488 -0.0061 -0.1251 -0.2960 -0.2647 -0.2626 0.3858 -0.0342 -0.2270 -0.2497 0.1042 -0.0326 -0.3456 -0.0534 0.2187 -0.0689 0.0550 -0.1998 -0.1972 -0.1543 -0.1477 -0.1758 0.0983 0.0889 0.0949 0.1003 0.0938 0.0979 0.0952 0.0899 0.1194 0.0882 0.0943 0.0930 0.0949 0.0976 0.0878 0.1220 0.1143 0.1602 0.1631 0.1166 0.1047 0.1381 0.1392 0.1565 0.1559 0.1575
va: 2.1287 2.0332 2.2751 3.6745 3.7681 3.8946 3.9015 3.9050 3.8735 4.1976 3.7109 3.9269 3.9431 3.8346 3.6317 4.0139 3.9541 3.6199 3.8226 3.5948 3.9610 3.9452 3.9015 3.8910 3.9053 1.0265 1.0377 1.0009 0.9994 1.0190 1.0030 1.0030 1.0026 1.0078 1.0081 0.9954 0.9965 0.9977 0.9981 1.0084 0.9934 1.0094 1.0060 0.9994 1.0068 1.0107 1.0130 1.0042 0.9911 0.9911 0.9906
dispcorr: -0.021985008 hartree
energy: -1079.774802783773
dipole: -27.87116 27.32393 -0.54723 -12.94287 13.66608 0.72321 9.61061 -9.15843 0.45218
magnitude: 1.01339 au
magnitude: 2.57583 debye
