program: Orca
programVersion: 5.0.2
elementType: O O O C C C C C C C C C C C C C C C C C C C C C C H H H H H H H H H H H H H H H H H H H H H H H H H H
charge: 0
multiplicity: 1
keywords: wb97x-d3
keywords: def2-TZVPP
keywords: def2/J RIJCOSX
keywords: DEFGRID2
keywords: scfconv7
keywords: smallprint printgap noloewdin
keywords: NOSOSCF
formula: C22H26O3
InChI: InChI=1/C22H26O3/c1-15(2)10-19-20(22(19,3)4)21(23)25-14-17-12-18(24-13-17)11-16-8-6-5-7-9-16/h5-10,12-13,19-20H,11,14H2,1-4H3
51 atoms
O  -1.120709 1.474121 1.385916
O  -2.415544 2.491453 -0.12248
O  1.667561 3.350584 -1.531475
C  -2.214386 -1.015093 -0.230923
C  -2.60211 -0.998993 1.220972
C  -2.849177 0.224734 0.378036
C  -0.748178 -1.025736 -0.588245
C  -3.068918 -1.787958 -1.204057
C  -3.766727 -1.769635 1.724979
C  -2.118281 1.503689 0.509109
C  -3.698098 -2.946213 2.35388
C  -4.934464 -3.640999 2.837871
C  -2.415732 -3.669603 2.627501
C  -0.276003 2.632228 1.484904
C  0.665859 2.708682 0.338664
C  1.701892 1.772145 0.018299
C  0.694452 3.638765 -0.642259
C  2.272121 2.20685 -1.129514
C  3.376771 1.682203 -1.978784
C  3.696008 0.251657 -1.636639
C  2.82067 -0.768369 -2.006716
C  4.846951 -0.077649 -0.930347
C  3.092435 -2.08777 -1.679021
C  5.12409 -1.399803 -0.602329
C  4.247541 -2.407597 -0.974878
H  -1.760355 -0.932036 1.903163
H  -3.876435 0.388983 0.067274
H  -0.56464 -0.480792 -1.516813
H  -0.1154 -0.595718 0.185267
H  -0.41427 -2.054313 -0.741245
H  -4.133242 -1.710788 -0.983318
H  -2.915572 -1.426661 -2.223076
H  -2.804752 -2.847887 -1.186656
H  -4.748383 -1.33401 1.559545
H  -5.840052 -3.079318 2.60792
H  -4.901337 -3.796016 3.919834
H  -5.030241 -4.633022 2.388171
H  -2.439077 -4.66952 2.185946
H  -2.269629 -3.813256 3.701575
H  -1.537755 -3.157982 2.236155
H  0.259746 2.49267 2.423022
H  -0.872543 3.541389 1.572561
H  1.972361 0.889072 0.575666
H  0.10417 4.521685 -0.833149
H  4.269847 2.303388 -1.86103
H  3.088413 1.758841 -3.031544
H  1.918432 -0.526958 -2.557287
H  5.536559 0.704467 -0.634929
H  2.404558 -2.869277 -1.976183
H  6.026872 -1.639858 -0.054987
H  4.461567 -3.437824 -0.720236
elementType: O C H
totalener: -1079.75151883 hartree
nucrepener: 2145.35259958 hartree
electener: -3225.10411840 hartree
oneelecener: -5729.57478418 hartree
twoeener: 2504.47066578 hartree
cpcmener: -0.02596498 hartree
kineticenergy: 1074.86133138 hartree
xcener: -106.462559529894 hartree
chargesum: -0.0000000
charge: -0.272585 -0.468371 -0.280428 0.172055 0.026556 -0.151974 -0.328845 -0.271478 -0.284624 0.411253 -0.029912 -0.229582 -0.251177 0.067057 -0.064710 -0.365461 -0.022942 0.214181 -0.016405 0.017948 -0.228597 -0.175243 -0.142558 -0.155793 -0.167163 0.101370 0.093954 0.105490 0.091149 0.100172 0.091667 0.099068 0.094330 0.119084 0.088738 0.094041 0.093391 0.095309 0.098898 0.086561 0.118085 0.117564 0.166260 0.173358 0.100057 0.109472 0.151569 0.138575 0.157031 0.156623 0.156983
qa: -0.2726 -0.4684 -0.2804 0.1721 0.0266 -0.1520 -0.3288 -0.2715 -0.2846 0.4113 -0.0299 -0.2296 -0.2512 0.0671 -0.0647 -0.3655 -0.0229 0.2142 -0.0164 0.0179 -0.2286 -0.1752 -0.1426 -0.1558 -0.1672 0.1014 0.0940 0.1055 0.0911 0.1002 0.0917 0.0991 0.0943 0.1191 0.0887 0.0940 0.0934 0.0953 0.0989 0.0866 0.1181 0.1176 0.1663 0.1734 0.1001 0.1095 0.1516 0.1386 0.1570 0.1566 0.1570
va: 2.1179 2.0347 2.2785 3.6889 3.7469 3.9069 3.9054 3.8995 3.8603 4.2006 3.7077 3.9289 3.9424 3.8553 3.6650 3.9582 3.9781 3.6332 3.8179 3.6167 3.9274 3.9279 3.8775 3.8978 3.9038 1.0185 1.0332 0.9980 1.0063 1.0020 1.0031 1.0024 1.0027 1.0084 1.0080 0.9954 0.9964 0.9977 0.9981 1.0087 0.9925 1.0068 0.9982 0.9985 1.0065 1.0072 0.9966 1.0045 0.9921 0.9909 0.9904
dispcorr: -0.025642151 hartree
energy: -1079.777160975754
dipole: -13.47727 14.25532 0.77805 -25.14533 23.82709 -1.31825 6.46328 -5.84495 0.61834
magnitude: 1.65090 au
magnitude: 4.19626 debye
