program: Orca
programVersion: 5.0.2
elementType: O O O C C C C C C C C C C C C C C C C C C C C C C H H H H H H H H H H H H H H H H H H H H H H H H H H
charge: 0
multiplicity: 1
keywords: wb97x-d3
keywords: def2-TZVPP
keywords: def2/J RIJCOSX
keywords: DEFGRID2
keywords: scfconv7
keywords: smallprint printgap noloewdin
keywords: NOSOSCF
formula: C22H26O3
InChI: InChI=1/C22H26O3/c1-15(2)10-19-20(22(19,3)4)21(23)25-14-17-12-18(24-13-17)11-16-8-6-5-7-9-16/h5-10,12-13,19-20H,11,14H2,1-4H3
51 atoms
O  -1.916121 2.247645 0.797859
O  -1.936211 1.695818 -1.368806
O  2.301922 2.017153 1.021818
C  -3.598349 -0.800404 -0.484789
C  -2.151337 -1.139065 -0.370678
C  -2.68227 0.130362 0.284134
C  -4.16393 -0.410619 -1.828302
C  -4.585835 -1.555137 0.373789
C  -1.649623 -2.257265 0.468669
C  -2.16867 1.416788 -0.215361
C  -0.607217 -2.189652 1.301379
C  -0.178457 -3.376403 2.108795
C  0.204086 -0.946775 1.513886
C  -1.053646 3.373586 0.54879
C  0.351974 2.8976 0.433016
C  1.052982 2.481539 -0.74503
C  1.168805 2.591763 1.469612
C  2.225697 1.94897 -0.328986
C  3.31038 1.225724 -1.041456
C  3.132412 -0.270052 -0.90708
C  2.112194 -0.914552 -1.604277
C  3.938935 -1.018106 -0.057512
C  1.905738 -2.277566 -1.459597
C  3.735792 -2.38568 0.08922
C  2.719033 -3.019217 -0.610293
H  -1.577527 -0.948656 -1.27607
H  -2.784614 0.085317 1.362307
H  -4.560914 -1.297395 -2.326787
H  -4.987999 0.297507 -1.718698
H  -3.426175 0.032978 -2.492081
H  -4.881216 -2.48972 -0.107548
H  -4.184167 -1.801223 1.357048
H  -5.490932 -0.963945 0.526942
H  -2.173638 -3.204808 0.370671
H  -0.817385 -4.243819 1.942924
H  -0.192229 -3.146947 3.177853
H  0.849525 -3.66166 1.869048
H  0.06593 -0.205776 0.729863
H  1.268488 -1.187179 1.561666
H  -0.048038 -0.476008 2.468883
H  -1.183314 4.015624 1.418049
H  -1.375307 3.929061 -0.332351
H  0.717727 2.559281 -1.766851
H  1.072638 2.718656 2.537334
H  4.288995 1.525563 -0.659468
H  3.276555 1.514083 -2.093465
H  1.469691 -0.342519 -2.264537
H  4.734305 -0.531252 0.494708
H  1.108493 -2.762362 -2.008938
H  4.373776 -2.95519 0.753347
H  2.560777 -4.084234 -0.497593
elementType: O C H
totalener: -1079.75004661 hartree
nucrepener: 2276.21183659 hartree
electener: -3355.96188320 hartree
oneelecener: -5992.00339744 hartree
twoeener: 2636.04151423 hartree
cpcmener: -0.02311093 hartree
kineticenergy: 1074.86882551 hartree
xcener: -106.464960915520 hartree
chargesum: -0.0000000
charge: -0.287143 -0.471632 -0.270090 0.158815 -0.001711 -0.091839 -0.287815 -0.286287 -0.302375 0.364860 -0.011798 -0.223755 -0.213581 0.075507 -0.070962 -0.288045 -0.052516 0.186365 -0.054336 0.058852 -0.206592 -0.192892 -0.141147 -0.126994 -0.205370 0.099395 0.091977 0.092415 0.098150 0.092829 0.098140 0.092324 0.097736 0.119063 0.089519 0.099573 0.090603 0.024927 0.100867 0.122414 0.120998 0.115993 0.156950 0.172532 0.106524 0.115756 0.137977 0.137256 0.154899 0.154836 0.158828
qa: -0.2871 -0.4716 -0.2701 0.1588 -0.0017 -0.0918 -0.2878 -0.2863 -0.3024 0.3649 -0.0118 -0.2238 -0.2136 0.0755 -0.0710 -0.2880 -0.0525 0.1864 -0.0543 0.0589 -0.2066 -0.1929 -0.1411 -0.1270 -0.2054 0.0994 0.0920 0.0924 0.0981 0.0928 0.0981 0.0923 0.0977 0.1191 0.0895 0.0996 0.0906 0.0249 0.1009 0.1224 0.1210 0.1160 0.1569 0.1725 0.1065 0.1158 0.1380 0.1373 0.1549 0.1548 0.1588
va: 2.1065 2.0271 2.2633 3.7167 3.7861 3.8102 3.8832 3.9048 3.8592 4.1870 3.7210 3.9262 3.9162 3.8546 3.6403 3.9671 3.9249 3.6413 3.8200 3.5609 3.8744 3.9486 3.8236 3.8545 3.8619 1.0242 1.0317 1.0008 0.9992 1.0216 1.0006 1.0026 1.0030 1.0056 1.0069 0.9963 0.9974 1.0136 1.0008 1.0037 0.9959 1.0084 1.0168 0.9949 1.0133 1.0079 1.0070 1.0054 0.9928 0.9908 0.9905
dispcorr: -0.030986526 hartree
energy: -1079.781033137904
dipole: -11.14507 11.32478 0.17971 -16.41775 16.11558 -0.30217 3.02580 -2.20197 0.82383
magnitude: 0.89571 au
magnitude: 2.27671 debye
