program: Orca
programVersion: 5.0.2
elementType: O O O C C C C C C C C C C C C C C C C C C C C C C H H H H H H H H H H H H H H H H H H H H H H H H H H
charge: 0
multiplicity: 1
keywords: wb97x-d3
keywords: def2-TZVPP
keywords: def2/J RIJCOSX
keywords: DEFGRID2
keywords: scfconv7
keywords: smallprint printgap noloewdin
keywords: NOSOSCF
formula: C22H26O3
InChI: InChI=1/C22H26O3/c1-15(2)10-19-20(22(19,3)4)21(23)25-14-17-12-18(24-13-17)11-16-8-6-5-7-9-16/h5-10,12-13,19-20H,11,14H2,1-4H3
51 atoms
O  -1.937414 2.201439 0.318978
O  -1.816522 0.709509 -1.342879
O  2.094115 1.179044 0.86394
C  -4.439086 -0.429086 -0.036222
C  -3.268391 -1.217842 0.436861
C  -3.238572 0.303136 0.541802
C  -4.736023 -0.38284 -1.51494
C  -5.684996 -0.368458 0.814582
C  -3.286001 -2.046825 1.666115
C  -2.274213 1.052931 -0.278758
C  -2.197771 -2.525704 2.275761
C  -2.305247 -3.391182 3.493474
C  -0.800782 -2.254348 1.807764
C  -0.897039 2.975366 -0.272647
C  0.442115 2.373533 -0.012868
C  1.651249 2.648483 -0.727074
C  0.776537 1.476836 0.944003
C  2.620168 1.896841 -0.151068
C  4.056856 1.689197 -0.463893
C  4.325411 0.302928 -1.003241
C  5.08766 -0.611353 -0.285467
C  3.794131 -0.084384 -2.23195
C  5.318037 -1.888212 -0.784765
C  4.021579 -1.356937 -2.732589
C  4.786226 -2.264487 -2.009064
H  -2.638044 -1.596575 -0.363217
H  -3.392272 0.710642 1.534414
H  -3.853113 -0.518612 -2.134964
H  -5.436931 -1.180537 -1.769396
H  -5.203038 0.563769 -1.794324
H  -5.467544 -0.340909 1.882349
H  -6.263297 0.526596 0.57715
H  -6.325058 -1.232992 0.625881
H  -4.258242 -2.294122 2.082176
H  -1.820563 -4.358101 3.332561
H  -3.341267 -3.578566 3.776205
H  -1.79992 -2.932171 4.347462
H  -0.181504 -1.892713 2.632671
H  -0.746677 -1.520756 1.004294
H  -0.326274 -3.172909 1.451039
H  -0.97916 3.958925 0.19221
H  -1.06207 3.109747 -1.343966
H  1.775264 3.31329 -1.567834
H  0.21777 0.980402 1.722108
H  4.667567 1.864057 0.425948
H  4.350846 2.441788 -1.198117
H  5.507325 -0.32535 0.671967
H  3.19305 0.616303 -2.800603
H  5.914747 -2.588728 -0.214202
H  3.602186 -1.641255 -3.689458
H  4.964917 -3.2584 -2.399139
elementType: O C H
totalener: -1079.75246655 hartree
nucrepener: 2115.01658470 hartree
electener: -3194.76905125 hartree
oneelecener: -5669.53343397 hartree
twoeener: 2474.76438273 hartree
cpcmener: -0.02644640 hartree
kineticenergy: 1074.85472258 hartree
xcener: -106.461476956484 hartree
chargesum: 0.0000000
charge: -0.291890 -0.467415 -0.282973 0.155801 -0.035972 -0.070643 -0.274569 -0.294140 -0.276043 0.352573 -0.005321 -0.229178 -0.260755 0.114106 -0.032284 -0.348071 -0.066084 0.208865 -0.061634 0.026297 -0.183630 -0.185816 -0.154287 -0.160200 -0.169082 0.102049 0.090424 0.093142 0.094092 0.098668 0.089238 0.098777 0.101364 0.123469 0.094146 0.088305 0.094412 0.095806 0.076506 0.105871 0.118106 0.112600 0.160589 0.180986 0.105591 0.116316 0.139149 0.142736 0.155664 0.156839 0.157502
qa: -0.2919 -0.4674 -0.2830 0.1558 -0.0360 -0.0706 -0.2746 -0.2941 -0.2760 0.3526 -0.0053 -0.2292 -0.2608 0.1141 -0.0323 -0.3481 -0.0661 0.2089 -0.0616 0.0263 -0.1836 -0.1858 -0.1543 -0.1602 -0.1691 0.1020 0.0904 0.0931 0.0941 0.0987 0.0892 0.0988 0.1014 0.1235 0.0941 0.0883 0.0944 0.0958 0.0765 0.1059 0.1181 0.1126 0.1606 0.1810 0.1056 0.1163 0.1391 0.1427 0.1557 0.1568 0.1575
va: 2.1139 2.0275 2.2682 3.7279 3.8263 3.7948 3.8809 3.9165 3.8868 4.1820 3.6901 3.9294 3.9507 3.8173 3.6317 4.0096 3.9444 3.6262 3.8264 3.6231 3.9472 3.9354 3.8958 3.9114 3.8999 1.0234 1.0341 1.0197 1.0007 0.9995 1.0013 1.0024 0.9987 1.0033 0.9955 1.0070 0.9965 0.9973 1.0113 0.9998 0.9909 1.0121 1.0055 0.9893 1.0093 1.0057 1.0040 1.0040 0.9914 0.9916 0.9905
dispcorr: -0.023338781 hartree
energy: -1079.775805330900
dipole: -17.71798 17.56802 -0.14997 -13.52243 13.93504 0.41261 6.68025 -5.99653 0.68372
magnitude: 0.81253 au
magnitude: 2.06529 debye
