program: Orca
programVersion: 5.0.2
elementType: O O O C C C C C C C C C C C C C C C C C C C C C C H H H H H H H H H H H H H H H H H H H H H H H H H H
charge: 0
multiplicity: 1
keywords: wb97x-d3
keywords: def2-TZVPP
keywords: def2/J RIJCOSX
keywords: DEFGRID2
keywords: scfconv7
keywords: smallprint printgap noloewdin
keywords: NOSOSCF
formula: C22H26O3
InChI: InChI=1/C22H26O3/c1-15(2)10-19-20(22(19,3)4)21(23)25-14-17-12-18(24-13-17)11-16-8-6-5-7-9-16/h5-10,12-13,19-20H,11,14H2,1-4H3
51 atoms
O  -1.867455 2.075513 0.199341
O  -1.906699 0.496935 -1.386274
O  2.097138 0.870512 0.843292
C  -4.6408 -0.267124 0.005966
C  -3.560629 -1.172193 0.486978
C  -3.344981 0.334777 0.525571
C  -4.962249 -0.248726 -1.468298
C  -5.847539 -0.015058 0.878157
C  -3.634992 -1.939773 1.753382
C  -2.320861 0.939112 -0.341331
C  -2.587716 -2.511953 2.35405
C  -2.748021 -3.302891 3.615827
C  -1.185531 -2.417892 1.835142
C  -0.786721 2.745349 -0.440106
C  0.523376 2.131869 -0.083172
C  1.802592 2.53096 -0.586328
C  0.767999 1.12296 0.784352
C  2.718734 1.731683 0.010445
C  4.192962 1.612699 -0.126532
C  4.592437 0.36469 -0.878936
C  4.37147 0.276873 -2.251743
C  5.162906 -0.719025 -0.221112
C  4.717084 -0.868338 -2.952525
C  5.509776 -1.869031 -0.92052
C  5.288659 -1.94665 -2.28773
H  -3.006873 -1.657909 -0.312012
H  -3.424786 0.796925 1.502836
H  -4.115777 -0.523088 -2.093562
H  -5.762752 -0.962145 -1.674358
H  -5.312259 0.735661 -1.785157
H  -6.322061 0.929188 0.604121
H  -6.590578 -0.805373 0.752846
H  -5.597821 0.042812 1.937601
H  -4.615277 -2.054277 2.206928
H  -2.400566 -4.331024 3.482873
H  -3.78489 -3.339881 3.9502
H  -2.147397 -2.877708 4.424407
H  -1.08819 -1.780897 0.957047
H  -0.802417 -3.407738 1.571654
H  -0.516005 -2.028271 2.606583
H  -0.835903 3.774437 -0.081718
H  -0.923255 2.774927 -1.523534
H  2.007011 3.309587 -1.304851
H  0.135928 0.517108 1.415201
H  4.664097 1.6186 0.859912
H  4.552611 2.498612 -0.652823
H  3.923935 1.1135 -2.776586
H  5.341775 -0.665163 0.846489
H  4.541832 -0.919626 -4.019748
H  5.954573 -2.704411 -0.394527
H  5.56038 -2.840858 -2.834135
elementType: O C H
totalener: -1079.75268312 hartree
nucrepener: 2092.95941549 hartree
electener: -3172.71209861 hartree
oneelecener: -5625.25606969 hartree
twoeener: 2452.54397108 hartree
cpcmener: -0.02681931 hartree
kineticenergy: 1074.85853901 hartree
xcener: -106.462311374232 hartree
chargesum: 0.0000000
charge: -0.291614 -0.467011 -0.284212 0.155909 -0.033862 -0.071042 -0.274120 -0.292556 -0.279981 0.353332 -0.000503 -0.230233 -0.269118 0.105847 -0.035101 -0.347002 -0.061083 0.213494 -0.069375 0.041277 -0.190232 -0.189425 -0.159140 -0.154116 -0.169889 0.100978 0.089714 0.092422 0.094222 0.098367 0.098741 0.101420 0.088890 0.123720 0.094570 0.088352 0.094393 0.077756 0.106836 0.097526 0.122523 0.112830 0.159016 0.182692 0.107663 0.117425 0.141134 0.138778 0.156691 0.155588 0.157509
qa: -0.2916 -0.4670 -0.2842 0.1559 -0.0339 -0.0710 -0.2741 -0.2926 -0.2800 0.3533 -0.0005 -0.2302 -0.2691 0.1058 -0.0351 -0.3470 -0.0611 0.2135 -0.0694 0.0413 -0.1902 -0.1894 -0.1591 -0.1541 -0.1699 0.1010 0.0897 0.0924 0.0942 0.0984 0.0987 0.1014 0.0889 0.1237 0.0946 0.0884 0.0944 0.0778 0.1068 0.0975 0.1225 0.1128 0.1590 0.1827 0.1077 0.1174 0.1411 0.1388 0.1567 0.1556 0.1575
va: 2.1149 2.0282 2.2712 3.7291 3.8239 3.7910 3.8836 3.9158 3.8907 4.1805 3.6838 3.9305 3.9511 3.8297 3.6451 4.0094 3.9464 3.6198 3.8241 3.6007 3.9400 3.9523 3.9100 3.8953 3.8997 1.0233 1.0343 1.0190 1.0007 0.9997 1.0024 0.9987 1.0017 1.0037 0.9956 1.0070 0.9966 1.0122 1.0003 0.9960 0.9908 1.0124 1.0062 0.9871 1.0096 1.0062 1.0039 1.0046 0.9913 0.9914 0.9904
dispcorr: -0.023097163 hartree
energy: -1079.775780282235
dipole: -19.37729 19.23861 -0.13869 -11.96751 12.51795 0.55044 7.29324 -6.57789 0.71536
magnitude: 0.91321 au
magnitude: 2.32120 debye
