program: Orca
programVersion: 5.0.2
elementType: O O O C C C C C C C C C C C C C C C C C C C C C C H H H H H H H H H H H H H H H H H H H H H H H H H H
charge: 0
multiplicity: 1
keywords: wb97x-d3
keywords: def2-TZVPP
keywords: def2/J RIJCOSX
keywords: DEFGRID2
keywords: scfconv7
keywords: smallprint printgap noloewdin
keywords: NOSOSCF
formula: C22H26O3
InChI: InChI=1/C22H26O3/c1-15(2)10-19-20(22(19,3)4)21(23)25-14-17-12-18(24-13-17)11-16-8-6-5-7-9-16/h5-10,12-13,19-20H,11,14H2,1-4H3
51 atoms
O  -1.125778 0.941932 1.469553
O  -1.021571 -1.281524 1.241747
O  2.44339 2.064223 -0.937969
C  -3.650521 -0.727276 -0.423699
C  -3.972365 -1.353869 0.889375
C  -3.082784 -0.128184 0.856656
C  -2.748415 -1.458401 -1.387615
C  -4.699866 0.110864 -1.112156
C  -5.327811 -1.277424 1.495467
C  -1.654165 -0.251305 1.200277
C  -5.576505 -1.176636 2.803696
C  -6.977266 -1.124079 3.332445
C  -4.501158 -1.100093 3.843238
C  0.269242 1.017612 1.805489
C  1.118267 1.15538 0.593142
C  1.439819 0.167328 -0.395401
C  1.756186 2.283275 0.200271
C  2.242809 0.774987 -1.299823
C  2.940092 0.291153 -2.519086
C  4.435108 0.221917 -2.317773
C  5.002746 -0.863488 -1.654598
C  5.264066 1.251599 -2.75063
C  6.370752 -0.92056 -1.432068
C  6.6345 1.198297 -2.527411
C  7.191835 0.11241 -1.867162
H  -3.431053 -2.275765 1.089639
H  -3.538031 0.808275 1.159664
H  -3.350969 -2.055434 -2.075933
H  -2.163452 -0.758178 -1.988067
H  -2.055852 -2.137496 -0.894409
H  -5.366412 -0.516816 -1.707454
H  -5.314523 0.675035 -0.410533
H  -4.233286 0.828479 -1.789957
H  -6.170857 -1.335119 0.81185
H  -7.14512 -0.207784 3.905157
H  -7.171741 -1.954345 4.016587
H  -7.721012 -1.162938 2.53642
H  -4.543468 -0.144818 4.374207
H  -3.497182 -1.211762 3.437052
H  -4.640911 -1.876431 4.600107
H  0.562242 0.155424 2.405215
H  0.361497 1.904254 2.430747
H  1.120923 -0.862292 -0.422981
H  1.81028 3.275573 0.622187
H  2.707083 0.938926 -3.368733
H  2.544641 -0.697299 -2.757492
H  4.367384 -1.671881 -1.310208
H  4.837781 2.101806 -3.27058
H  6.79695 -1.773805 -0.919306
H  7.267013 2.007266 -2.871135
H  8.259629 0.069195 -1.693751
elementType: O C H
totalener: -1079.75382129 hartree
nucrepener: 2054.00399679 hartree
electener: -3133.75781807 hartree
oneelecener: -5547.27210167 hartree
twoeener: 2413.51428359 hartree
cpcmener: -0.02404401 hartree
kineticenergy: 1074.85419723 hartree
xcener: -106.458799537258 hartree
chargesum: -0.0000000
charge: -0.282898 -0.480385 -0.278434 0.155335 -0.023319 -0.107735 -0.284159 -0.287571 -0.292288 0.407413 -0.014227 -0.228469 -0.240807 0.068265 -0.083405 -0.309803 -0.036261 0.200953 -0.061222 0.054119 -0.199065 -0.192475 -0.155546 -0.156652 -0.171729 0.103209 0.094219 0.096001 0.097893 0.093489 0.097772 0.092917 0.097681 0.121465 0.093590 0.096002 0.089074 0.098266 0.081093 0.100161 0.118507 0.114846 0.161031 0.173964 0.112212 0.114922 0.142487 0.138933 0.156521 0.156565 0.157545
qa: -0.2829 -0.4804 -0.2784 0.1553 -0.0233 -0.1077 -0.2842 -0.2876 -0.2923 0.4074 -0.0142 -0.2285 -0.2408 0.0683 -0.0834 -0.3098 -0.0363 0.2010 -0.0612 0.0541 -0.1991 -0.1925 -0.1555 -0.1567 -0.1717 0.1032 0.0942 0.0960 0.0979 0.0935 0.0978 0.0929 0.0977 0.1215 0.0936 0.0960 0.0891 0.0983 0.0811 0.1002 0.1185 0.1148 0.1610 0.1740 0.1122 0.1149 0.1425 0.1389 0.1565 0.1566 0.1575
va: 2.1169 2.0201 2.2821 3.6947 3.8205 3.8188 3.8916 3.9058 3.8862 4.1321 3.7088 3.9310 3.9362 3.8548 3.6796 4.0027 3.9717 3.6589 3.8186 3.5792 3.9436 3.9567 3.9016 3.8989 3.9001 1.0264 1.0307 1.0024 1.0000 1.0168 0.9999 1.0020 1.0029 1.0035 0.9966 0.9962 1.0064 0.9984 1.0153 0.9998 1.0085 0.9985 1.0182 0.9944 1.0068 1.0080 1.0033 1.0061 0.9911 0.9909 0.9904
dispcorr: -0.022846630 hartree
energy: -1079.776667917804
dipole: -28.19318 27.60434 -0.58884 -7.22630 7.84231 0.61601 5.40395 -5.37415 0.02980
magnitude: 0.85270 au
magnitude: 2.16738 debye
