program: Orca
programVersion: 5.0.2
elementType: O O O C C C C C C C C C C C C C C C C C C C C C C H H H H H H H H H H H H H H H H H H H H H H H H H H
charge: 0
multiplicity: 1
keywords: wb97x-d3
keywords: def2-TZVPP
keywords: def2/J RIJCOSX
keywords: DEFGRID2
keywords: scfconv7
keywords: smallprint printgap noloewdin
keywords: NOSOSCF
formula: C22H26O3
InChI: InChI=1/C22H26O3/c1-15(2)10-19-20(22(19,3)4)21(23)25-14-17-12-18(24-13-17)11-16-8-6-5-7-9-16/h5-10,12-13,19-20H,11,14H2,1-4H3
51 atoms
O  -1.707441 2.013299 -0.003359
O  -1.006772 1.092388 1.909632
O  2.656036 2.584014 0.338893
C  -1.243963 -1.468956 0.049701
C  -2.250482 -1.481376 1.151084
C  -2.129298 -0.249312 0.279432
C  0.225353 -1.421661 0.394821
C  -1.520654 -2.239231 -1.218668
C  -3.478623 -2.315325 1.109473
C  -1.559256 0.989272 0.83978
C  -4.558047 -2.117976 1.870812
C  -5.743246 -3.031547 1.798571
C  -4.680568 -0.992913 2.851882
C  -0.950439 3.204348 0.26484
C  0.492608 2.945423 0.019658
C  1.077527 2.498736 -1.208509
C  1.501448 2.97117 0.91987
C  2.390399 2.287714 -0.955159
C  3.489985 1.706769 -1.772169
C  3.486564 0.198128 -1.676497
C  2.881239 -0.567979 -2.668239
C  4.033246 -0.447687 -0.57029
C  2.823774 -1.951367 -2.560628
C  3.977201 -1.830318 -0.460232
C  3.371808 -2.586884 -1.455247
H  -1.825844 -1.344887 2.142267
H  -2.896484 -0.097038 -0.472082
H  0.430654 -0.935382 1.34619
H  0.618627 -2.43785 0.460144
H  0.791434 -0.899261 -0.379623
H  -2.568566 -2.20501 -1.516594
H  -0.932025 -1.834237 -2.044479
H  -1.24029 -3.28841 -1.101994
H  -3.480855 -3.158937 0.425158
H  -6.646498 -2.481359 1.52109
H  -5.948143 -3.488292 2.770723
H  -5.60215 -3.833896 1.074207
H  -5.584576 -0.409351 2.657788
H  -3.833873 -0.307742 2.833912
H  -4.777876 -1.376652 3.871544
H  -1.128508 3.567947 1.278264
H  -1.34902 3.941893 -0.430783
H  0.576382 2.33755 -2.150672
H  1.544947 3.236237 1.964927
H  4.451765 2.108973 -1.445739
H  3.353447 2.011609 -2.810493
H  2.449458 -0.078583 -3.533762
H  4.508227 0.133216 0.211928
H  2.351563 -2.532232 -3.343001
H  4.408652 -2.318066 0.404854
H  3.329625 -3.665211 -1.369548
elementType: O C H
totalener: -1079.75160584 hartree
nucrepener: 2189.72625553 hartree
electener: -3269.47786138 hartree
oneelecener: -5819.10875566 hartree
twoeener: 2549.63089428 hartree
cpcmener: -0.02483307 hartree
kineticenergy: 1074.86042301 hartree
xcener: -106.461472919241 hartree
chargesum: -0.0000000
charge: -0.285612 -0.464811 -0.274006 0.204326 -0.053870 -0.077485 -0.266769 -0.307766 -0.277164 0.365813 -0.016310 -0.229232 -0.245739 0.093175 -0.055445 -0.363919 -0.032244 0.226117 -0.058804 0.031210 -0.166949 -0.190093 -0.160319 -0.149917 -0.180159 0.101112 0.091181 0.100412 0.103863 0.050216 0.093389 0.094749 0.102208 0.123130 0.094031 0.094106 0.088295 0.094316 0.079461 0.099485 0.115487 0.119645 0.156178 0.173460 0.111854 0.107413 0.137002 0.138188 0.155418 0.155080 0.156295
qa: -0.2856 -0.4648 -0.2740 0.2043 -0.0539 -0.0775 -0.2668 -0.3078 -0.2772 0.3658 -0.0163 -0.2292 -0.2457 0.0932 -0.0554 -0.3639 -0.0322 0.2261 -0.0588 0.0312 -0.1669 -0.1901 -0.1603 -0.1499 -0.1802 0.1011 0.0912 0.1004 0.1039 0.0502 0.0934 0.0947 0.1022 0.1231 0.0940 0.0941 0.0883 0.0943 0.0795 0.0995 0.1155 0.1196 0.1562 0.1735 0.1119 0.1074 0.1370 0.1382 0.1554 0.1551 0.1563
va: 2.1089 2.0328 2.2746 3.6789 3.8545 3.8051 3.8800 3.9127 3.8835 4.1920 3.7115 3.9289 3.9409 3.8462 3.6278 3.9664 3.9599 3.5966 3.8159 3.6214 3.8882 3.9302 3.8624 3.8773 3.8637 1.0256 1.0327 1.0220 0.9997 1.0107 1.0026 1.0036 0.9980 1.0025 0.9966 0.9957 1.0069 0.9989 1.0180 0.9984 1.0076 0.9910 1.0127 0.9973 1.0137 1.0105 1.0041 1.0108 0.9917 0.9917 0.9918
dispcorr: -0.026946298 hartree
energy: -1079.778552141121
dipole: -17.79540 17.43831 -0.35709 -18.12067 18.01894 -0.10173 2.08361 -3.15081 -1.06720
magnitude: 1.12995 au
magnitude: 2.87210 debye
