program: Orca
programVersion: 5.0.2
elementType: O O O C C C C C C C C C C C C C C C C C C C C C C H H H H H H H H H H H H H H H H H H H H H H H H H H
charge: 0
multiplicity: 1
keywords: wb97x-d3
keywords: def2-TZVPP
keywords: def2/J RIJCOSX
keywords: DEFGRID2
keywords: scfconv7
keywords: smallprint printgap noloewdin
keywords: NOSOSCF
formula: C22H26O3
InChI: InChI=1/C22H26O3/c1-15(2)10-19-20(22(19,3)4)21(23)25-14-17-12-18(24-13-17)11-16-8-6-5-7-9-16/h5-10,12-13,19-20H,11,14H2,1-4H3
51 atoms
O  -1.732895 2.275468 0.275391
O  -0.870363 1.142899 2.001467
O  2.030965 3.195848 -1.678938
C  -1.650742 -1.207996 0.025437
C  -2.510938 -1.218501 1.256242
C  -2.363001 0.060051 0.478779
C  -0.154143 -1.343285 0.171717
C  -2.179654 -1.846153 -1.234652
C  -3.833391 -1.89526 1.289134
C  -1.580478 1.18573 1.024171
C  -4.039423 -3.150597 1.696052
C  -5.41381 -3.746666 1.721521
C  -2.941771 -4.057509 2.16017
C  -0.877717 3.40528 0.523866
C  0.443289 3.202014 -0.128915
C  1.559615 2.440992 0.346564
C  0.796335 3.634826 -1.362966
C  2.491084 2.466514 -0.635528
C  3.809355 1.78829 -0.782366
C  3.627952 0.309569 -1.031169
C  3.251605 -0.157506 -2.288515
C  3.777418 -0.604914 0.006469
C  3.030689 -1.510608 -2.502425
C  3.557535 -1.960091 -0.204916
C  3.18218 -2.41702 -1.460246
H  -1.95091 -1.246424 2.18718
H  -3.201229 0.353154 -0.145546
H  0.22291 -0.988692 1.128951
H  0.126681 -2.394922 0.083869
H  0.368269 -0.800701 -0.619674
H  -2.006477 -2.924753 -1.217603
H  -3.249096 -1.687514 -1.370632
H  -1.669416 -1.444919 -2.112715
H  -4.69049 -1.314078 0.960007
H  -5.684594 -4.068761 2.730796
H  -5.46837 -4.637504 1.089993
H  -6.174216 -3.044595 1.378988
H  -2.948523 -4.992013 1.593078
H  -3.08302 -4.335454 3.208395
H  -1.949975 -3.618442 2.062804
H  -0.781589 3.588983 1.594346
H  -1.39999 4.252872 0.083058
H  1.652462 1.932971 1.292853
H  0.291563 4.242888 -2.098126
H  4.394128 1.939218 0.126593
H  4.370112 2.247607 -1.599045
H  3.129571 0.54242 -3.107414
H  4.068447 -0.25513 0.990254
H  2.740436 -1.859019 -3.485646
H  3.679988 -2.658315 0.613533
H  3.010698 -3.472812 -1.62702
elementType: O C H
totalener: -1079.75175226 hartree
nucrepener: 2170.20370206 hartree
electener: -3249.95545432 hartree
oneelecener: -5779.94634842 hartree
twoeener: 2529.99089410 hartree
cpcmener: -0.02429070 hartree
kineticenergy: 1074.85986772 hartree
xcener: -106.459771227306 hartree
chargesum: -0.0000000
charge: -0.281081 -0.467484 -0.272330 0.171070 -0.020579 -0.117227 -0.322786 -0.277687 -0.253594 0.405821 -0.040950 -0.228311 -0.248221 0.073345 -0.074107 -0.343196 -0.038417 0.233219 -0.047538 0.021555 -0.190343 -0.184104 -0.141357 -0.143021 -0.191113 0.100124 0.092297 0.097435 0.100787 0.088879 0.097015 0.093089 0.099370 0.119232 0.094072 0.093636 0.088513 0.094714 0.102105 0.086705 0.118211 0.116343 0.160348 0.175280 0.107858 0.108609 0.138790 0.137702 0.156049 0.155464 0.155809
qa: -0.2811 -0.4675 -0.2723 0.1711 -0.0206 -0.1172 -0.3228 -0.2777 -0.2536 0.4058 -0.0410 -0.2283 -0.2482 0.0733 -0.0741 -0.3432 -0.0384 0.2332 -0.0475 0.0216 -0.1903 -0.1841 -0.1414 -0.1430 -0.1911 0.1001 0.0923 0.0974 0.1008 0.0889 0.0970 0.0931 0.0994 0.1192 0.0941 0.0936 0.0885 0.0947 0.1021 0.0867 0.1182 0.1163 0.1603 0.1753 0.1079 0.1086 0.1388 0.1377 0.1560 0.1555 0.1558
va: 2.1215 2.0406 2.2828 3.6738 3.8116 3.8635 3.8960 3.9007 3.8540 4.2067 3.7085 3.9283 3.9367 3.8511 3.6819 3.9473 3.9642 3.6038 3.8044 3.6341 3.9325 3.9016 3.8747 3.8497 3.8774 1.0249 1.0358 1.0163 1.0008 0.9978 1.0008 1.0030 1.0028 1.0071 0.9951 0.9966 1.0077 0.9983 0.9982 1.0085 1.0084 0.9968 1.0200 0.9940 1.0077 1.0158 1.0095 1.0041 0.9908 0.9918 0.9923
dispcorr: -0.026380550 hartree
energy: -1079.778132810669
dipole: -15.08790 14.89293 -0.19497 -24.85679 24.52715 -0.32964 3.36372 -4.08920 -0.72548
magnitude: 0.82036 au
magnitude: 2.08519 debye
