program: Orca
programVersion: 5.0.2
elementType: O O O C C C C C C C C C C C C C C C C C C C C C C H H H H H H H H H H H H H H H H H H H H H H H H H H
charge: 0
multiplicity: 1
keywords: wb97x-d3
keywords: def2-TZVPP
keywords: def2/J RIJCOSX
keywords: DEFGRID2
keywords: scfconv7
keywords: smallprint printgap noloewdin
keywords: NOSOSCF
formula: C22H26O3
InChI: InChI=1/C22H26O3/c1-15(2)10-19-20(22(19,3)4)21(23)25-14-17-12-18(24-13-17)11-16-8-6-5-7-9-16/h5-10,12-13,19-20H,11,14H2,1-4H3
51 atoms
O  -1.773019 2.377717 0.695528
O  -2.013881 1.538758 -1.361885
O  2.258495 2.327149 -1.104655
C  -3.941441 -0.50397 0.033354
C  -2.571739 -1.104773 -0.04251
C  -2.758051 0.290665 0.544749
C  -4.631577 -0.127219 -1.255224
C  -4.907401 -0.983047 1.091481
C  -2.108657 -2.194487 0.835055
C  -2.164625 1.437104 -0.167357
C  -1.291846 -3.190816 0.477459
C  -0.861204 -4.223628 1.474577
C  -0.717698 -3.351851 -0.902409
C  -0.973218 3.456833 0.190447
C  0.411857 2.984916 -0.069347
C  1.332963 2.469331 0.899552
C  1.032754 2.865692 -1.264841
C  2.433346 2.08038 0.214943
C  3.675598 1.374137 0.620328
C  3.626414 -0.080052 0.211767
C  4.34953 -0.544581 -0.880763
C  2.810889 -0.970873 0.906454
C  4.26141 -1.874788 -1.274291
C  2.72429 -2.298869 0.518929
C  3.447156 -2.754867 -0.577057
H  -2.144522 -1.096442 -1.039882
H  -2.687843 0.357722 1.62472
H  -3.941325 0.086069 -2.067803
H  -5.270214 -0.951724 -1.57865
H  -5.271535 0.747114 -1.118001
H  -5.385411 -1.914839 0.782511
H  -4.43261 -1.158073 2.056296
H  -5.695558 -0.243737 1.24765
H  -2.450728 -2.16354 1.865199
H  -1.268483 -4.03548 2.467965
H  0.228482 -4.25761 1.559891
H  -1.173592 -5.22448 1.165047
H  0.210186 -2.783832 -1.014314
H  -1.394065 -3.022272 -1.690632
H  -0.471538 -4.395989 -1.101492
H  -0.994567 4.205527 0.981765
H  -1.420892 3.899426 -0.700667
H  1.181483 2.389381 1.964983
H  0.734726 3.118575 -2.270694
H  3.772335 1.458117 1.704061
H  4.552858 1.858256 0.18403
H  4.988793 0.137199 -1.429357
H  2.237382 -0.62034 1.757231
H  4.829602 -2.222116 -2.127944
H  2.090822 -2.980653 1.072182
H  3.375261 -3.79098 -0.882435
elementType: O C H
totalener: -1079.75272030 hartree
nucrepener: 2176.78532639 hartree
electener: -3256.53804669 hartree
oneelecener: -5793.09775528 hartree
twoeener: 2536.55970859 hartree
cpcmener: -0.02636441 hartree
kineticenergy: 1074.87336997 hartree
xcener: -106.463928294219 hartree
chargesum: -0.0000000
charge: -0.289489 -0.473349 -0.277066 0.105386 0.043978 -0.092469 -0.276182 -0.277437 -0.282070 0.397862 -0.036654 -0.212429 -0.290218 0.098372 -0.080034 -0.345619 -0.017822 0.207712 -0.065587 0.056799 -0.197926 -0.197268 -0.132715 -0.181741 -0.197609 0.094124 0.085333 0.092583 0.093581 0.096775 0.098428 0.088966 0.097000 0.113821 0.087133 0.088479 0.096119 0.106055 0.104625 0.098992 0.119837 0.113329 0.158401 0.172907 0.115405 0.107607 0.139088 0.140012 0.156299 0.193260 0.155419
qa: -0.2895 -0.4733 -0.2771 0.1054 0.0440 -0.0925 -0.2762 -0.2774 -0.2821 0.3979 -0.0367 -0.2124 -0.2902 0.0984 -0.0800 -0.3456 -0.0178 0.2077 -0.0656 0.0568 -0.1979 -0.1973 -0.1327 -0.1817 -0.1976 0.0941 0.0853 0.0926 0.0936 0.0968 0.0984 0.0890 0.0970 0.1138 0.0871 0.0885 0.0961 0.1061 0.1046 0.0990 0.1198 0.1133 0.1584 0.1729 0.1154 0.1076 0.1391 0.1400 0.1563 0.1933 0.1554
va: 2.1139 2.0328 2.2771 3.6932 3.7727 3.8444 3.8984 3.9143 3.8995 4.1668 3.7212 3.9164 3.9398 3.8380 3.6452 4.0034 3.9577 3.6219 3.8339 3.5947 3.9609 3.9480 3.8854 3.8547 3.9091 1.0305 1.0369 1.0210 0.9999 0.9997 1.0010 1.0062 1.0014 1.0124 1.0095 0.9957 0.9957 0.9921 1.0035 0.9996 0.9909 1.0102 1.0099 0.9981 1.0074 1.0109 1.0046 1.0071 0.9901 0.9606 0.9939
dispcorr: -0.024861123 hartree
energy: -1079.777581424561
dipole: -14.68781 14.76049 0.07268 -20.39930 20.14356 -0.25574 3.59726 -2.50336 1.09390
magnitude: 1.12574 au
magnitude: 2.86141 debye
