program: Orca
programVersion: 5.0.2
elementType: O O O C C C C C C C C C C C C C C C C C C C C C C H H H H H H H H H H H H H H H H H H H H H H H H H H
charge: 0
multiplicity: 1
keywords: wb97x-d3
keywords: def2-TZVPP
keywords: def2/J RIJCOSX
keywords: DEFGRID2
keywords: scfconv7
keywords: smallprint printgap noloewdin
keywords: NOSOSCF
formula: C22H26O3
InChI: InChI=1/C22H26O3/c1-15(2)10-19-20(22(19,3)4)21(23)25-14-17-12-18(24-13-17)11-16-8-6-5-7-9-16/h5-10,12-13,19-20H,11,14H2,1-4H3
51 atoms
O  -1.693257 2.373329 0.872927
O  -2.013039 1.557004 -1.182151
O  2.16661 2.456268 -1.240738
C  -3.78199 -0.572505 0.297469
C  -2.408975 -1.125413 0.072567
C  -2.575667 0.236985 0.734448
C  -4.595316 -0.157112 -0.904048
C  -4.634219 -1.128266 1.413787
C  -1.834535 -2.238871 0.851155
C  -2.085799 1.428526 0.017457
C  -1.090866 -3.229242 0.346841
C  -0.526708 -4.299996 1.230174
C  -0.743371 -3.345064 -1.112418
C  -0.96543 3.493099 0.340757
C  0.405073 3.065939 -0.041427
C  1.404336 2.530854 0.834434
C  0.928332 2.988705 -1.286087
C  2.447326 2.168734 0.052047
C  3.703765 1.423725 0.32778
C  3.516359 -0.041471 0.007382
C  3.034114 -0.914543 0.978646
C  3.747536 -0.527867 -1.275923
C  2.786733 -2.245824 0.675973
C  3.49856 -1.859239 -1.582719
C  3.015666 -2.722643 -0.60842
H  -2.076511 -1.063955 -0.95841
H  -2.412384 0.262104 1.806224
H  -5.263869 0.670331 -0.656526
H  -3.987204 0.145003 -1.753168
H  -5.217605 -0.99344 -1.229465
H  -4.065645 -1.350559 2.316132
H  -5.4144 -0.415452 1.688014
H  -5.126138 -2.050148 1.096468
H  -2.020143 -2.232689 1.921063
H  -0.728732 -4.117279 2.285757
H  0.556178 -4.38378 1.103255
H  -0.939998 -5.279202 0.972205
H  -1.574436 -3.084794 -1.768189
H  -0.438443 -4.361926 -1.362759
H  0.092625 -2.691754 -1.375658
H  -0.946408 4.21597 1.15553
H  -1.495715 3.946451 -0.498029
H  1.339035 2.412705 1.905135
H  0.552671 3.267092 -2.258556
H  3.954576 1.548773 1.381819
H  4.531353 1.839673 -0.251877
H  2.845103 -0.54851 1.981381
H  4.123781 0.137607 -2.044108
H  2.413524 -2.910853 1.444586
H  3.681663 -2.222284 -2.586233
H  2.819493 -3.760045 -0.848047
elementType: O C H
totalener: -1079.75177096 hartree
nucrepener: 2196.07587310 hartree
electener: -3275.82764406 hartree
oneelecener: -5831.86786348 hartree
twoeener: 2556.04021942 hartree
cpcmener: -0.02631435 hartree
kineticenergy: 1074.86788195 hartree
xcener: -106.462622276906 hartree
chargesum: -0.0000000
charge: -0.289389 -0.473741 -0.276491 0.105498 0.053195 -0.100636 -0.277104 -0.272859 -0.287144 0.398649 -0.027907 -0.218126 -0.300707 0.099444 -0.071152 -0.356479 -0.021758 0.215438 -0.062998 0.079245 -0.209480 -0.217479 -0.138637 -0.115838 -0.228575 0.093596 0.085445 0.096421 0.092750 0.093730 0.087799 0.096753 0.098097 0.114118 0.088266 0.083757 0.101796 0.108006 0.102031 0.106526 0.120063 0.113682 0.157629 0.172607 0.107453 0.112865 0.139508 0.139003 0.168272 0.156561 0.158301
qa: -0.2894 -0.4737 -0.2765 0.1055 0.0532 -0.1006 -0.2771 -0.2729 -0.2871 0.3986 -0.0279 -0.2181 -0.3007 0.0994 -0.0712 -0.3565 -0.0218 0.2154 -0.0630 0.0792 -0.2095 -0.2175 -0.1386 -0.1158 -0.2286 0.0936 0.0854 0.0964 0.0928 0.0937 0.0878 0.0968 0.0981 0.1141 0.0883 0.0838 0.1018 0.1080 0.1020 0.1065 0.1201 0.1137 0.1576 0.1726 0.1075 0.1129 0.1395 0.1390 0.1683 0.1566 0.1583
va: 2.1151 2.0312 2.2773 3.6970 3.7566 3.8559 3.8990 3.9136 3.8981 4.1661 3.6998 3.9174 3.9414 3.8380 3.6363 4.0044 3.9592 3.6118 3.8371 3.5630 3.9659 3.9794 3.8265 3.8642 3.8808 1.0309 1.0371 0.9998 1.0213 1.0000 1.0063 1.0017 1.0013 1.0124 1.0093 0.9960 0.9954 1.0014 1.0011 0.9917 0.9910 1.0097 1.0105 0.9978 1.0110 1.0111 1.0051 1.0093 0.9791 0.9899 0.9912
dispcorr: -0.025600874 hartree
energy: -1079.777371836536
dipole: -13.86407 13.99067 0.12660 -21.07283 20.77907 -0.29376 3.57949 -2.54748 1.03201
magnitude: 1.08045 au
magnitude: 2.74628 debye
