program: Orca
programVersion: 5.0.2
elementType: O O O C C C C C C C C C C C C C C C C C C C C C C H H H H H H H H H H H H H H H H H H H H H H H H H H
charge: 0
multiplicity: 1
keywords: wb97x-d3
keywords: def2-TZVPP
keywords: def2/J RIJCOSX
keywords: DEFGRID2
keywords: scfconv7
keywords: smallprint printgap noloewdin
keywords: NOSOSCF
formula: C22H26O3
InChI: InChI=1/C22H26O3/c1-15(2)10-19-20(22(19,3)4)21(23)25-14-17-12-18(24-13-17)11-16-8-6-5-7-9-16/h5-10,12-13,19-20H,11,14H2,1-4H3
51 atoms
O  -0.807252 -0.145209 0.719281
O  -1.703829 -1.629262 2.123331
O  2.469156 1.360525 -1.312869
C  -4.160957 -1.193623 0.159673
C  -4.407561 -0.558276 1.49623
C  -3.121715 -0.260189 0.759897
C  -3.909397 -2.679699 0.101753
C  -4.902601 -0.669787 -1.045629
C  -5.395995 0.527664 1.68592
C  -1.839413 -0.767196 1.286993
C  -6.503874 0.460904 2.430299
C  -7.416607 1.643322 2.557073
C  -6.942586 -0.755589 3.187297
C  0.502746 -0.510977 1.153531
C  1.485119 0.246796 0.333784
C  2.840306 0.526673 0.699327
C  1.319922 0.777911 -0.899692
C  3.3885 1.20497 -0.336857
C  4.751538 1.745379 -0.580936
C  5.519458 0.917041 -1.583524
C  6.318937 -0.139762 -1.157001
C  5.416536 1.171801 -2.948127
C  7.004655 -0.924741 -2.073264
C  6.099218 0.386516 -3.867392
C  6.895866 -0.664129 -3.432852
H  -4.291652 -1.237596 2.334633
H  -3.05443 0.710031 0.278772
H  -3.458339 -3.075234 1.009604
H  -4.854551 -3.206704 -0.045794
H  -3.257613 -2.935503 -0.736805
H  -4.370926 -0.922018 -1.965425
H  -5.896888 -1.118228 -1.105232
H  -5.031024 0.412215 -1.025899
H  -5.190384 1.460454 1.168021
H  -7.05774 2.504057 1.9924
H  -7.521464 1.947989 3.60218
H  -8.423555 1.404559 2.204212
H  -7.942166 -1.062355 2.86691
H  -7.016921 -0.543206 4.257559
H  -6.282223 -1.612324 3.062139
H  0.652811 -1.588098 1.037218
H  0.629842 -0.27655 2.213841
H  3.3357 0.25692 1.619285
H  0.482779 0.830015 -1.577688
H  5.280574 1.76209 0.372748
H  4.684843 2.781343 -0.924312
H  6.408413 -0.348964 -0.097078
H  4.80383 1.99491 -3.297003
H  7.626678 -1.739523 -1.724605
H  6.010855 0.598383 -4.925523
H  7.431319 -1.274389 -4.148964
elementType: O C H
totalener: -1079.75415286 hartree
nucrepener: 1983.40294941 hartree
electener: -3063.15710227 hartree
oneelecener: -5405.69366441 hartree
twoeener: 2342.53656215 hartree
cpcmener: -0.02566092 hartree
kineticenergy: 1074.84388202 hartree
xcener: -106.457987491986 hartree
chargesum: -0.0000000
charge: -0.279011 -0.472849 -0.279307 0.129453 0.023311 -0.112486 -0.284093 -0.259837 -0.275783 0.397258 -0.033426 -0.225370 -0.251850 0.108440 -0.032526 -0.346911 -0.067237 0.202344 -0.069366 0.063346 -0.201925 -0.199397 -0.150519 -0.155074 -0.174940 0.091448 0.089315 0.092319 0.095074 0.099346 0.097840 0.095967 0.087718 0.118640 0.088405 0.093784 0.092714 0.094290 0.096316 0.089463 0.108632 0.109140 0.162084 0.171169 0.108849 0.115563 0.139589 0.139631 0.156842 0.156075 0.157546
qa: -0.2790 -0.4728 -0.2793 0.1295 0.0233 -0.1125 -0.2841 -0.2598 -0.2758 0.3973 -0.0334 -0.2254 -0.2518 0.1084 -0.0325 -0.3469 -0.0672 0.2023 -0.0694 0.0633 -0.2019 -0.1994 -0.1505 -0.1551 -0.1749 0.0914 0.0893 0.0923 0.0951 0.0993 0.0978 0.0960 0.0877 0.1186 0.0884 0.0938 0.0927 0.0943 0.0963 0.0895 0.1086 0.1091 0.1621 0.1712 0.1088 0.1156 0.1396 0.1396 0.1568 0.1561 0.1575
va: 2.1398 2.0365 2.2738 3.6936 3.7609 3.8998 3.9043 3.9055 3.8745 4.1589 3.7276 3.9254 3.9445 3.8352 3.7112 4.0220 3.9542 3.6555 3.8252 3.5746 3.9487 3.9619 3.8940 3.8997 3.9045 1.0331 1.0367 1.0183 1.0013 0.9993 1.0029 1.0032 1.0044 1.0086 1.0085 0.9955 0.9967 0.9975 0.9973 1.0086 0.9948 0.9945 1.0061 1.0009 1.0095 1.0068 1.0043 1.0091 0.9908 0.9911 0.9905
dispcorr: -0.021089237 hartree
energy: -1079.775242096948
dipole: -33.91946 33.73198 -0.18748 -3.65048 4.12860 0.47812 5.63134 -5.95433 -0.32299
magnitude: 0.60669 au
magnitude: 1.54208 debye
