program: Orca
programVersion: 5.0.2
elementType: O O O C C C C C C C C C C C C C C C C C C C C C C H H H H H H H H H H H H H H H H H H H H H H H H H H
charge: 0
multiplicity: 1
keywords: wb97x-d3
keywords: def2-TZVPP
keywords: def2/J RIJCOSX
keywords: DEFGRID2
keywords: scfconv7
keywords: smallprint printgap noloewdin
keywords: NOSOSCF
formula: C22H26O3
InChI: InChI=1/C22H26O3/c1-15(2)10-19-20(22(19,3)4)21(23)25-14-17-12-18(24-13-17)11-16-8-6-5-7-9-16/h5-10,12-13,19-20H,11,14H2,1-4H3
51 atoms
O  -1.431622 0.963079 0.892713
O  -1.938913 0.831302 -1.281331
O  2.954782 0.196335 0.650885
C  -2.947065 -1.780572 0.902802
C  -3.636077 -0.704972 1.676852
C  -3.216769 -0.432033 0.24965
C  -1.539649 -2.174072 1.280451
C  -3.760393 -2.931883 0.362523
C  -5.080755 -0.789914 2.019477
C  -2.142468 0.505204 -0.133602
C  -5.946173 0.226555 1.979737
C  -7.384733 0.040203 2.355531
C  -5.574613 1.616769 1.56483
C  -0.314848 1.828433 0.632015
C  0.928277 1.056882 0.369158
C  1.261522 0.256375 -0.773224
C  1.997594 0.973412 1.195193
C  2.498546 -0.243102 -0.545224
C  3.398447 -1.111512 -1.346567
C  4.646472 -0.385103 -1.787546
C  5.847399 -0.554221 -1.107295
C  4.603715 0.491925 -2.868865
C  6.988003 0.133126 -1.503654
C  5.741205 1.178107 -3.268275
C  6.938005 1.000492 -2.585369
H  -3.014646 -0.22857 2.430702
H  -4.008129 -0.448735 -0.492282
H  -1.565724 -3.012813 1.979162
H  -0.972758 -2.496116 0.404259
H  -0.983094 -1.372761 1.762209
H  -4.763309 -2.630632 0.059238
H  -3.2718 -3.372049 -0.509072
H  -3.863024 -3.719179 1.112714
H  -5.441889 -1.759862 2.351727
H  -7.606151 -0.988029 2.642167
H  -8.042924 0.307121 1.524125
H  -7.663142 0.690147 3.189276
H  -6.154095 1.930054 0.692048
H  -4.518959 1.73037 1.325147
H  -5.811864 2.328173 2.360469
H  -0.203396 2.424193 1.536944
H  -0.54775 2.508384 -0.188071
H  0.660889 0.081318 -1.650969
H  2.207967 1.405497 2.161817
H  2.835315 -1.456395 -2.215294
H  3.670705 -2.002286 -0.773411
H  5.895205 -1.233363 -0.264038
H  3.672362 0.636153 -3.404972
H  7.917015 -0.011448 -0.966685
H  5.694255 1.850526 -4.11569
H  7.827067 1.533175 -2.898086
elementType: O C H
totalener: -1079.75152313 hartree
nucrepener: 2070.86722116 hartree
electener: -3150.61874429 hartree
oneelecener: -5580.76321051 hartree
twoeener: 2430.14446621 hartree
cpcmener: -0.02490718 hartree
kineticenergy: 1074.85765785 hartree
xcener: -106.460154988379 hartree
chargesum: -0.0000000
charge: -0.273625 -0.474127 -0.278315 0.146858 0.031888 -0.146141 -0.285098 -0.289764 -0.317846 0.418407 -0.012392 -0.228354 -0.237651 0.041687 -0.074474 -0.323774 -0.030585 0.207362 -0.056516 0.049923 -0.187775 -0.198130 -0.158556 -0.157519 -0.169646 0.106090 0.098705 0.097986 0.100340 0.087895 0.092711 0.097764 0.096704 0.119695 0.088851 0.093687 0.095372 0.097704 0.080600 0.100649 0.114796 0.121044 0.159372 0.174757 0.116294 0.110826 0.139282 0.142474 0.155958 0.156795 0.157814
qa: -0.2736 -0.4741 -0.2783 0.1469 0.0319 -0.1461 -0.2851 -0.2898 -0.3178 0.4184 -0.0124 -0.2284 -0.2377 0.0417 -0.0745 -0.3238 -0.0306 0.2074 -0.0565 0.0499 -0.1878 -0.1981 -0.1586 -0.1575 -0.1696 0.1061 0.0987 0.0980 0.1003 0.0879 0.0927 0.0978 0.0967 0.1197 0.0889 0.0937 0.0954 0.0977 0.0806 0.1006 0.1148 0.1210 0.1594 0.1748 0.1163 0.1108 0.1393 0.1425 0.1560 0.1568 0.1578
va: 2.0925 2.0246 2.2819 3.6965 3.7594 3.8547 3.8940 3.9064 3.8850 4.1169 3.7076 3.9311 3.9317 3.8719 3.6567 4.0006 3.9619 3.6626 3.8125 3.5831 3.9524 3.9442 3.9014 3.9026 3.8983 1.0218 1.0266 1.0035 1.0003 1.0155 1.0022 1.0025 1.0003 1.0040 1.0065 0.9969 0.9963 0.9990 1.0172 0.9994 1.0003 1.0079 1.0228 0.9941 1.0069 1.0059 1.0054 1.0033 0.9913 0.9911 0.9903
dispcorr: -0.023733881 hartree
energy: -1079.775257014915
dipole: -26.66861 26.45993 -0.20868 -7.03281 6.76168 -0.27113 7.82495 -6.84484 0.98012
magnitude: 1.03812 au
magnitude: 2.63868 debye
