program: Orca
programVersion: 5.0.2
elementType: O O O C C C C C C C C C C C C C C C C C C C C C C H H H H H H H H H H H H H H H H H H H H H H H H H H
charge: 0
multiplicity: 1
keywords: wb97x-d3
keywords: def2-TZVPP
keywords: def2/J RIJCOSX
keywords: DEFGRID2
keywords: scfconv7
keywords: smallprint printgap noloewdin
keywords: NOSOSCF
formula: C22H26O3
InChI: InChI=1/C22H26O3/c1-15(2)10-19-20(22(19,3)4)21(23)25-14-17-12-18(24-13-17)11-16-8-6-5-7-9-16/h5-10,12-13,19-20H,11,14H2,1-4H3
51 atoms
O  -1.032845 1.033812 -0.189674
O  -3.013701 1.832032 0.460178
O  2.897587 2.203058 -1.633338
C  -3.006306 -1.009437 1.907449
C  -4.005469 -0.962478 0.787518
C  -2.578931 -0.526211 0.533193
C  -3.15972 -0.029165 3.043977
C  -2.44046 -2.337777 2.347799
C  -4.519164 -2.176902 0.123174
C  -2.271091 0.895603 0.277221
C  -5.809094 -2.432533 -0.113701
C  -6.234488 -3.686908 -0.813722
C  -6.916786 -1.492932 0.283642
C  -0.563155 2.363474 -0.46647
C  0.902662 2.274192 -0.669618
C  1.900629 2.06496 0.336226
C  1.57348 2.346136 -1.842008
C  3.091972 2.030833 -0.304323
C  4.485029 1.808074 0.159082
C  5.038112 0.490052 -0.328977
C  4.575528 -0.706908 0.213477
C  5.993169 0.444458 -1.338112
C  5.062426 -1.923449 -0.239553
C  6.483027 -0.773299 -1.794723
C  6.01952 -1.960193 -1.246575
H  -4.712966 -0.142811 0.863658
H  -1.950207 -1.221089 -0.013753
H  -2.19022 0.214504 3.48455
H  -3.636683 0.902683 2.747199
H  -3.774283 -0.470795 3.831124
H  -1.486945 -2.194857 2.860233
H  -3.119692 -2.830472 3.04682
H  -2.265119 -3.022936 1.519268
H  -3.781357 -2.904701 -0.201476
H  -6.898933 -4.283001 -0.182053
H  -5.386543 -4.312097 -1.094257
H  -6.799197 -3.458771 -1.722182
H  -7.89303 -1.966141 0.174132
H  -6.929366 -0.594066 -0.338082
H  -6.832361 -1.163757 1.320447
H  -0.797871 3.023817 0.370176
H  -1.06168 2.754385 -1.356342
H  1.741387 1.956437 1.397987
H  1.251017 2.498435 -2.860763
H  4.480402 1.834027 1.250177
H  5.129146 2.627026 -0.172379
H  3.826941 -0.685565 0.997734
H  6.360425 1.368047 -1.770087
H  4.696696 -2.845338 0.194715
H  7.227965 -0.792648 -2.580271
H  6.400882 -2.909716 -1.59976
elementType: O C H
totalener: -1079.75466705 hartree
nucrepener: 2019.75696556 hartree
electener: -3099.51163261 hartree
oneelecener: -5478.47508379 hartree
twoeener: 2378.96345118 hartree
cpcmener: -0.02673364 hartree
kineticenergy: 1074.86109173 hartree
xcener: -106.458653688478 hartree
chargesum: -0.0000000
charge: -0.272748 -0.476903 -0.277406 0.103838 0.052057 -0.106177 -0.278064 -0.268285 -0.301820 0.403426 -0.011840 -0.220909 -0.284565 0.076244 -0.083531 -0.315990 -0.024362 0.193243 -0.061568 0.039625 -0.191220 -0.183970 -0.159397 -0.156950 -0.167628 0.089307 0.087964 0.098594 0.091881 0.096485 0.097022 0.097214 0.087940 0.115952 0.094324 0.084384 0.097790 0.094357 0.105175 0.101705 0.109341 0.114909 0.161417 0.175202 0.116832 0.108097 0.142244 0.137944 0.156125 0.156058 0.156637
qa: -0.2727 -0.4769 -0.2774 0.1038 0.0521 -0.1062 -0.2781 -0.2683 -0.3018 0.4034 -0.0118 -0.2209 -0.2846 0.0762 -0.0835 -0.3160 -0.0244 0.1932 -0.0616 0.0396 -0.1912 -0.1840 -0.1594 -0.1569 -0.1676 0.0893 0.0880 0.0986 0.0919 0.0965 0.0970 0.0972 0.0879 0.1160 0.0943 0.0844 0.0978 0.0944 0.1052 0.1017 0.1093 0.1149 0.1614 0.1752 0.1168 0.1081 0.1422 0.1379 0.1561 0.1561 0.1566
va: 2.1209 2.0304 2.2783 3.7106 3.7485 3.8858 3.9051 3.9100 3.8977 4.1640 3.6953 3.9224 3.9410 3.8486 3.7270 3.9945 3.9486 3.6364 3.8207 3.5969 3.9398 3.9493 3.9095 3.8982 3.8998 1.0319 1.0358 0.9996 1.0191 1.0008 1.0023 1.0018 1.0057 1.0103 0.9934 1.0104 0.9927 1.0043 0.9956 0.9963 0.9991 0.9980 1.0073 0.9952 1.0065 1.0079 1.0034 1.0049 0.9916 0.9911 0.9907
dispcorr: -0.021140160 hartree
energy: -1079.775807207976
dipole: -26.40850 26.91803 0.50953 -17.29698 16.63959 -0.65739 9.61102 -9.31653 0.29449
magnitude: 0.88233 au
magnitude: 2.24271 debye
