program: Orca
programVersion: 5.0.2
elementType: O O O C C C C C C C C C C C C C C C C C C C C C C H H H H H H H H H H H H H H H H H H H H H H H H H H
charge: 0
multiplicity: 1
keywords: wb97x-d3
keywords: def2-TZVPP
keywords: def2/J RIJCOSX
keywords: DEFGRID2
keywords: scfconv7
keywords: smallprint printgap noloewdin
keywords: NOSOSCF
formula: C22H26O3
InChI: InChI=1/C22H26O3/c1-15(2)10-19-20(22(19,3)4)21(23)25-14-17-12-18(24-13-17)11-16-8-6-5-7-9-16/h5-10,12-13,19-20H,11,14H2,1-4H3
51 atoms
O  -0.971565 0.071014 0.852278
O  -1.955978 -0.836308 2.63726
O  2.352584 1.157215 -1.300033
C  -4.014535 -1.701682 0.363334
C  -4.585885 -0.653193 1.254963
C  -3.219594 -0.431926 0.642177
C  -3.589459 -3.017996 0.964408
C  -4.534023 -1.83238 -1.047898
C  -5.738842 0.194273 0.853539
C  -2.019772 -0.437112 1.497577
C  -5.921487 1.463807 1.225675
C  -7.135247 2.23444 0.806304
C  -4.952972 2.218715 2.0818
C  0.273645 0.139315 1.543567
C  1.302378 0.582639 0.566932
C  2.675765 0.857018 0.865126
C  1.166929 0.782713 -0.763576
C  3.26338 1.199688 -0.305906
C  4.662482 1.541154 -0.671508
C  5.337899 0.414367 -1.417183
C  6.044621 -0.563492 -0.722653
C  5.234783 0.310493 -2.801448
C  6.640115 -1.621466 -1.395199
C  5.826886 -0.748386 -3.476742
C  6.531399 -1.717835 -2.775964
H  -4.547625 -0.902352 2.313158
H  -3.170631 0.258889 -0.192388
H  -4.425053 -3.720629 0.935924
H  -2.768185 -3.463418 0.398917
H  -3.275353 -2.933824 2.003195
H  -5.419533 -2.471257 -1.077413
H  -4.803331 -0.871681 -1.487664
H  -3.779773 -2.287923 -1.692605
H  -6.500704 -0.276894 0.23831
H  -7.703802 2.575083 1.675827
H  -7.803285 1.64398 0.179151
H  -6.857178 3.133637 0.249704
H  -4.580686 3.103254 1.557434
H  -4.092718 1.626504 2.389339
H  -5.444492 2.584728 2.98723
H  0.538071 -0.838039 1.95705
H  0.203802 0.8393 2.381455
H  3.159067 0.801309 1.828195
H  0.335307 0.709934 -1.445795
H  5.207078 1.759493 0.248149
H  4.680496 2.453574 -1.273783
H  6.132775 -0.49576 0.355618
H  4.692639 1.065235 -3.359054
H  7.190844 -2.370473 -0.840181
H  5.738867 -0.815028 -4.553752
H  6.995346 -2.542064 -3.302521
elementType: O C H
totalener: -1079.75335396 hartree
nucrepener: 2013.93003803 hartree
electener: -3093.68339200 hartree
oneelecener: -5466.74505296 hartree
twoeener: 2373.06166097 hartree
cpcmener: -0.02477395 hartree
kineticenergy: 1074.85672544 hartree
xcener: -106.460861979732 hartree
chargesum: -0.0000000
charge: -0.275197 -0.475804 -0.280398 0.147769 -0.023410 -0.090557 -0.275540 -0.288399 -0.285986 0.381953 -0.017140 -0.228036 -0.240454 0.106790 -0.018767 -0.356263 -0.073108 0.208668 -0.072015 0.065161 -0.201523 -0.200164 -0.150863 -0.153743 -0.175103 0.101261 0.094735 0.096154 0.098973 0.091337 0.098453 0.093044 0.098189 0.121549 0.095603 0.088766 0.094118 0.097285 0.081069 0.100076 0.107425 0.110503 0.159740 0.171109 0.108253 0.115578 0.139793 0.139033 0.156601 0.156136 0.157346
qa: -0.2752 -0.4758 -0.2804 0.1478 -0.0234 -0.0906 -0.2755 -0.2884 -0.2860 0.3820 -0.0171 -0.2280 -0.2405 0.1068 -0.0188 -0.3563 -0.0731 0.2087 -0.0720 0.0652 -0.2015 -0.2002 -0.1509 -0.1537 -0.1751 0.1013 0.0947 0.0962 0.0990 0.0913 0.0985 0.0930 0.0982 0.1215 0.0956 0.0888 0.0941 0.0973 0.0811 0.1001 0.1074 0.1105 0.1597 0.1711 0.1083 0.1156 0.1398 0.1390 0.1566 0.1561 0.1573
va: 2.1318 2.0295 2.2690 3.7148 3.8171 3.8087 3.8925 3.9096 3.8872 4.1436 3.7110 3.9304 3.9375 3.8550 3.7053 4.0211 3.9568 3.6422 3.8279 3.5701 3.9470 3.9622 3.8948 3.8988 3.9043 1.0286 1.0274 1.0014 0.9994 1.0174 0.9998 1.0017 1.0031 1.0032 0.9960 1.0066 0.9967 0.9987 1.0153 0.9993 0.9947 0.9907 1.0070 1.0013 1.0099 1.0066 1.0042 1.0094 0.9909 0.9910 0.9906
dispcorr: -0.021816175 hartree
energy: -1079.775170139763
dipole: -28.38130 28.43544 0.05414 -1.00590 1.46246 0.45655 1.99619 -2.53414 -0.53795
magnitude: 0.70765 au
magnitude: 1.79869 debye
