program: Orca
programVersion: 5.0.2
elementType: O O O C C C C C C C C C C C C C C C C C C C C C C H H H H H H H H H H H H H H H H H H H H H H H H H H
charge: 0
multiplicity: 1
keywords: wb97x-d3
keywords: def2-TZVPP
keywords: def2/J RIJCOSX
keywords: DEFGRID2
keywords: scfconv7
keywords: smallprint printgap noloewdin
keywords: NOSOSCF
formula: C22H26O3
InChI: InChI=1/C22H26O3/c1-15(2)10-19-20(22(19,3)4)21(23)25-14-17-12-18(24-13-17)11-16-8-6-5-7-9-16/h5-10,12-13,19-20H,11,14H2,1-4H3
51 atoms
O  -1.741086 2.132424 0.117716
O  -1.019596 1.158057 1.998717
O  2.169942 2.757991 -1.628933
C  -1.752351 -1.3469 0.180873
C  -2.678528 -1.242657 1.361044
C  -2.449781 -0.031961 0.490892
C  -0.271936 -1.499002 0.434888
C  -2.206816 -2.062522 -1.067556
C  -4.016784 -1.872167 1.368566
C  -1.665195 1.119693 0.977434
C  -4.483962 -2.740966 2.270961
C  -5.873947 -3.292659 2.158033
C  -3.707863 -3.249192 3.446839
C  -0.882016 3.269859 0.311746
C  0.482693 2.983418 -0.205572
C  1.575954 2.339173 0.461513
C  0.91072 3.209786 -1.470175
C  2.570123 2.225702 -0.44963
C  3.904862 1.57398 -0.413683
C  3.870052 0.243114 -1.127962
C  3.449034 -0.901384 -0.455411
C  4.19656 0.146796 -2.476956
C  3.356694 -2.11784 -1.116383
C  4.103674 -1.06933 -3.141662
C  3.682397 -2.204923 -2.463883
H  -2.167941 -1.208909 2.317902
H  -3.244801 0.227506 -0.200595
H  0.049427 -1.075072 1.384216
H  -0.007153 -2.558451 0.446828
H  0.310745 -1.026643 -0.359096
H  -2.067591 -3.140865 -0.963859
H  -3.255689 -1.885731 -1.303404
H  -1.61837 -1.736724 -1.927783
H  -4.678374 -1.590886 0.553981
H  -6.463307 -3.060002 3.048859
H  -5.859863 -4.382655 2.076243
H  -6.405961 -2.898605 1.292434
H  -3.628647 -4.338334 3.40831
H  -4.221928 -3.014375 4.381849
H  -2.698199 -2.85109 3.514316
H  -0.867635 3.570888 1.359587
H  -1.35027 4.069173 -0.260492
H  1.613216 2.003082 1.485229
H  0.445294 3.672358 -2.327195
H  4.184988 1.433429 0.631184
H  4.659132 2.225515 -0.862193
H  3.186743 -0.83993 0.59487
H  4.528742 1.027825 -3.013738
H  3.029627 -2.998721 -0.578275
H  4.361234 -1.129098 -4.191606
H  3.610277 -3.152907 -2.981577
elementType: O C H
totalener: -1079.75382039 hartree
nucrepener: 2137.12500640 hartree
electener: -3216.87882679 hartree
oneelecener: -5713.65133500 hartree
twoeener: 2496.77250822 hartree
cpcmener: -0.02510318 hartree
kineticenergy: 1074.86547472 hartree
xcener: -106.461460075749 hartree
chargesum: -0.0000000
charge: -0.278009 -0.469193 -0.275614 0.140387 0.029145 -0.110703 -0.306026 -0.268688 -0.276838 0.399490 -0.046072 -0.221045 -0.251317 0.065831 -0.059093 -0.349369 -0.036195 0.220395 -0.054841 0.099847 -0.259576 -0.204808 -0.145343 -0.150202 -0.171951 0.091087 0.089055 0.095287 0.101092 0.100351 0.096483 0.088302 0.098527 0.116708 0.092939 0.092679 0.088356 0.094806 0.095556 0.089467 0.118584 0.118305 0.157226 0.173118 0.111076 0.112624 0.146038 0.139580 0.159312 0.156122 0.157106
qa: -0.2780 -0.4692 -0.2756 0.1404 0.0291 -0.1107 -0.3060 -0.2687 -0.2768 0.3995 -0.0461 -0.2210 -0.2513 0.0658 -0.0591 -0.3494 -0.0362 0.2204 -0.0548 0.0998 -0.2596 -0.2048 -0.1453 -0.1502 -0.1720 0.0911 0.0891 0.0953 0.1011 0.1004 0.0965 0.0883 0.0985 0.1167 0.0929 0.0927 0.0884 0.0948 0.0956 0.0895 0.1186 0.1183 0.1572 0.1731 0.1111 0.1126 0.1460 0.1396 0.1593 0.1561 0.1571
va: 2.1224 2.0392 2.2794 3.6837 3.7817 3.8488 3.9093 3.8989 3.8683 4.2014 3.7526 3.9230 3.9430 3.8556 3.6442 3.9812 3.9706 3.6133 3.8169 3.5185 3.9291 3.9694 3.8624 3.8950 3.9074 1.0325 1.0378 1.0176 1.0021 0.9917 1.0026 1.0055 1.0025 1.0100 0.9960 0.9965 1.0088 0.9975 0.9970 1.0099 1.0074 0.9968 1.0199 0.9944 1.0097 1.0093 1.0012 1.0073 0.9893 0.9907 0.9903
dispcorr: -0.024653408 hartree
energy: -1079.778473802384
dipole: -17.21784 16.99546 -0.22238 -22.58326 22.31894 -0.26431 6.76016 -7.37653 -0.61637
magnitude: 0.70656 au
magnitude: 1.79594 debye
