program: Orca
programVersion: 5.0.2
elementType: O O O C C C C C C C C C C C C C C C C C C C C C C H H H H H H H H H H H H H H H H H H H H H H H H H H
charge: 0
multiplicity: 1
keywords: wb97x-d3
keywords: def2-TZVPP
keywords: def2/J RIJCOSX
keywords: DEFGRID2
keywords: scfconv7
keywords: smallprint printgap noloewdin
keywords: NOSOSCF
formula: C22H26O3
InChI: InChI=1/C22H26O3/c1-15(2)10-19-20(22(19,3)4)21(23)25-14-17-12-18(24-13-17)11-16-8-6-5-7-9-16/h5-10,12-13,19-20H,11,14H2,1-4H3
51 atoms
O  -1.434427 0.404184 -0.334028
O  -3.143082 -0.204486 -1.634195
O  2.608291 2.152722 -0.794768
C  -4.752988 0.538721 0.992015
C  -4.695259 -0.938489 0.796248
C  -3.411319 -0.13882 0.745293
C  -5.37955 1.397828 -0.078188
C  -4.947492 1.086334 2.385459
C  -4.941905 -1.89541 1.907338
C  -2.689378 0.00653 -0.532364
C  -4.249395 -3.015128 2.132936
C  -4.592496 -3.928307 3.270509
C  -3.091126 -3.457861 1.292339
C  -0.600644 0.554479 -1.492428
C  0.742497 0.978467 -1.029223
C  1.644076 0.258998 -0.178787
C  1.385925 2.1199 -1.363491
C  2.758544 1.019462 -0.070027
C  4.060214 0.821411 0.619169
C  5.182038 0.590814 -0.365606
C  5.529569 -0.701937 -0.746406
C  5.855878 1.663977 -0.942402
C  6.531196 -0.920378 -1.682156
C  6.855024 1.448657 -1.881909
C  7.195427 0.15562 -2.255469
H  -5.039124 -1.270906 -0.181066
H  -2.768596 -0.201515 1.61663
H  -5.322292 0.955484 -1.070478
H  -6.436818 1.552606 0.14702
H  -4.907515 2.381638 -0.11973
H  -6.00979 1.142253 2.633532
H  -4.460884 0.47664 3.147307
H  -4.539822 2.096292 2.462108
H  -5.777148 -1.666174 2.564137
H  -4.849387 -4.927527 2.908817
H  -5.431814 -3.557968 3.859269
H  -3.738805 -4.054042 3.941941
H  -2.902274 -2.810059 0.438678
H  -3.260422 -4.467924 0.909857
H  -2.175477 -3.506308 1.888252
H  -1.023161 1.29758 -2.172384
H  -0.544901 -0.397257 -2.026445
H  1.480751 -0.702202 0.283498
H  1.10927 2.96266 -1.978404
H  3.961255 -0.03758 1.283747
H  4.286116 1.686326 1.249197
H  5.012681 -1.546837 -0.305697
H  5.60365 2.677405 -0.652573
H  6.79267 -1.93289 -1.963035
H  7.369494 2.293666 -2.322042
H  7.975699 -0.012479 -2.986675
elementType: O C H
totalener: -1079.75457056 hartree
nucrepener: 2018.09682431 hartree
electener: -3097.85139487 hartree
oneelecener: -5475.07340467 hartree
twoeener: 2377.22200980 hartree
cpcmener: -0.02553037 hartree
kineticenergy: 1074.85553416 hartree
xcener: -106.458317106121 hartree
chargesum: 0.0000000
charge: -0.276354 -0.479176 -0.279380 0.138435 -0.006199 -0.095778 -0.279387 -0.283525 -0.296103 0.387799 -0.014806 -0.227922 -0.241425 0.089982 -0.079272 -0.318226 -0.032481 0.193127 -0.065351 0.067134 -0.206473 -0.197604 -0.146835 -0.154542 -0.175343 0.100686 0.096802 0.092003 0.094481 0.099139 0.097575 0.092655 0.097969 0.120743 0.095537 0.089517 0.093465 0.084564 0.101412 0.098073 0.108043 0.111944 0.161883 0.174228 0.106583 0.116462 0.139023 0.138199 0.156079 0.155334 0.157307
qa: -0.2764 -0.4792 -0.2794 0.1384 -0.0062 -0.0958 -0.2794 -0.2835 -0.2961 0.3878 -0.0148 -0.2279 -0.2414 0.0900 -0.0793 -0.3182 -0.0325 0.1931 -0.0654 0.0671 -0.2065 -0.1976 -0.1468 -0.1545 -0.1753 0.1007 0.0968 0.0920 0.0945 0.0991 0.0976 0.0927 0.0980 0.1207 0.0955 0.0895 0.0935 0.0846 0.1014 0.0981 0.1080 0.1119 0.1619 0.1742 0.1066 0.1165 0.1390 0.1382 0.1561 0.1553 0.1573
va: 2.1167 2.0272 2.2784 3.7115 3.7949 3.8266 3.8965 3.9075 3.8917 4.1344 3.7144 3.9306 3.9342 3.8467 3.7400 4.0027 3.9497 3.6491 3.8295 3.5725 3.9506 3.9584 3.8904 3.8995 3.9052 1.0276 1.0268 1.0182 1.0015 0.9989 1.0005 1.0027 1.0029 1.0044 0.9963 1.0064 0.9969 1.0123 0.9995 0.9988 1.0031 0.9922 1.0083 0.9947 1.0106 1.0046 1.0043 1.0102 0.9909 0.9914 0.9906
dispcorr: -0.021890771 hartree
energy: -1079.776461327497
dipole: -23.71169 24.17018 0.45850 -10.65209 10.48985 -0.16224 13.56106 -12.49662 1.06443
magnitude: 1.17028 au
magnitude: 2.97462 debye
