program: Orca
programVersion: 5.0.2
elementType: O O O C C C C C C C C C C C C C C C C C C C C C C H H H H H H H H H H H H H H H H H H H H H H H H H H
charge: 0
multiplicity: 1
keywords: wb97x-d3
keywords: def2-TZVPP
keywords: def2/J RIJCOSX
keywords: DEFGRID2
keywords: scfconv7
keywords: smallprint printgap noloewdin
keywords: NOSOSCF
formula: C22H26O3
InChI: InChI=1/C22H26O3/c1-15(2)10-19-20(22(19,3)4)21(23)25-14-17-12-18(24-13-17)11-16-8-6-5-7-9-16/h5-10,12-13,19-20H,11,14H2,1-4H3
51 atoms
O  -1.528396 1.96383 0.476817
O  -0.773032 0.72936 2.184733
O  2.189092 3.180891 -1.374876
C  -1.272218 -1.545022 0.068232
C  -2.305214 -1.606246 1.14176
C  -2.052622 -0.287985 0.439998
C  0.184555 -1.683722 0.441433
C  -1.582436 -2.112166 -1.296206
C  -3.602785 -2.307339 0.960244
C  -1.388317 0.820041 1.147324
C  -4.717107 -2.039459 1.646128
C  -5.97863 -2.81486 1.419868
C  -4.80767 -0.961866 2.681838
C  -0.706958 3.084331 0.851353
C  0.610287 2.972924 0.169873
C  1.686965 2.080081 0.477391
C  0.980963 3.615012 -0.963528
C  2.613216 2.241877 -0.496826
C  3.888218 1.52949 -0.789821
C  3.630561 0.105149 -1.22516
C  2.928593 -0.157325 -2.400942
C  4.051145 -0.966165 -0.44494
C  2.653981 -1.461009 -2.784926
C  3.77861 -2.274424 -0.82821
C  3.077845 -2.52584 -1.997973
H  -1.899289 -1.642601 2.14977
H  -2.787628 0.019928 -0.2953
H  0.482398 -2.730908 0.357564
H  0.819835 -1.106595 -0.234238
H  0.399653 -1.369158 1.460194
H  -1.396971 -3.188347 -1.319479
H  -2.615856 -1.945504 -1.600468
H  -0.94039 -1.653971 -2.051426
H  -3.630177 -3.11124 0.229968
H  -6.79229 -2.155263 1.106166
H  -6.313935 -3.300567 2.34026
H  -5.858603 -3.585543 0.658279
H  -3.884049 -0.396867 2.800361
H  -5.067642 -1.383666 3.656699
H  -5.602813 -0.253727 2.433116
H  -0.609043 3.150852 1.935025
H  -1.24745 3.964934 0.507452
H  1.755323 1.392272 1.304934
H  0.504402 4.375049 -1.563667
H  4.520229 1.531191 0.100156
H  4.438776 2.069156 -1.564089
H  2.591492 0.664892 -3.022127
H  4.594985 -0.778538 0.473566
H  2.107486 -1.647417 -3.700967
H  4.112677 -3.09638 -0.207666
H  2.861356 -3.543707 -2.296223
elementType: O C H
totalener: -1079.75057300 hartree
nucrepener: 2180.97551092 hartree
electener: -3260.72608392 hartree
oneelecener: -5801.39464029 hartree
twoeener: 2540.66855638 hartree
cpcmener: -0.02345499 hartree
kineticenergy: 1074.85225991 hartree
xcener: -106.459662295457 hartree
chargesum: 0.0000000
charge: -0.284032 -0.472718 -0.273368 0.211041 -0.046468 -0.099274 -0.284751 -0.304117 -0.281943 0.391952 -0.015176 -0.228426 -0.242495 0.072135 -0.075598 -0.341184 -0.037975 0.238538 -0.038771 -0.015051 -0.159080 -0.159383 -0.170315 -0.161843 -0.166174 0.103830 0.090300 0.102556 0.051615 0.102924 0.100422 0.094427 0.095808 0.122584 0.094201 0.094667 0.088565 0.079721 0.099634 0.095350 0.117895 0.116193 0.161577 0.174962 0.102924 0.109752 0.138402 0.138389 0.156100 0.155891 0.155789
qa: -0.2840 -0.4727 -0.2734 0.2110 -0.0465 -0.0993 -0.2848 -0.3041 -0.2819 0.3920 -0.0152 -0.2284 -0.2425 0.0721 -0.0756 -0.3412 -0.0380 0.2385 -0.0388 -0.0151 -0.1591 -0.1594 -0.1703 -0.1618 -0.1662 0.1038 0.0903 0.1026 0.0516 0.1029 0.1004 0.0944 0.0958 0.1226 0.0942 0.0947 0.0886 0.0797 0.0996 0.0954 0.1179 0.1162 0.1616 0.1750 0.1029 0.1098 0.1384 0.1384 0.1561 0.1559 0.1558
va: 2.1141 2.0271 2.2808 3.6401 3.8540 3.8220 3.8888 3.9130 3.8848 4.1684 3.7089 3.9296 3.9404 3.8503 3.7045 3.9484 3.9550 3.6075 3.7972 3.6906 3.8764 3.8890 3.8763 3.8795 3.8535 1.0241 1.0342 1.0020 1.0101 1.0210 0.9986 1.0029 1.0037 1.0026 0.9965 0.9959 1.0069 1.0160 0.9990 0.9987 1.0112 0.9970 1.0158 0.9940 1.0088 1.0134 1.0109 1.0035 0.9923 0.9918 0.9918
dispcorr: -0.026777929 hartree
energy: -1079.777350924825
dipole: -18.15948 17.85850 -0.30098 -18.30702 18.27151 -0.03551 3.24454 -3.96415 -0.71961
magnitude: 0.78083 au
magnitude: 1.98471 debye
