program: Orca
programVersion: 5.0.2
elementType: O O O C C C C C C C C C C C C C C C C C C C C C C H H H H H H H H H H H H H H H H H H H H H H H H H H
charge: 0
multiplicity: 1
keywords: wb97x-d3
keywords: def2-TZVPP
keywords: def2/J RIJCOSX
keywords: DEFGRID2
keywords: scfconv7
keywords: smallprint printgap noloewdin
keywords: NOSOSCF
formula: C22H26O3
InChI: InChI=1/C22H26O3/c1-15(2)10-19-20(22(19,3)4)21(23)25-14-17-12-18(24-13-17)11-16-8-6-5-7-9-16/h5-10,12-13,19-20H,11,14H2,1-4H3
51 atoms
O  -1.740964 2.174957 0.164234
O  -0.816628 1.100785 1.893145
O  2.109593 2.802176 -1.718988
C  -1.904858 -1.361831 0.24433
C  -2.725859 -1.144048 1.479992
C  -2.47527 0.016048 0.552696
C  -0.425645 -1.628554 0.382085
C  -2.531287 -2.085219 -0.921089
C  -4.106733 -1.675187 1.615404
C  -1.590118 1.122718 0.964323
C  -4.422557 -2.841728 2.183469
C  -5.84644 -3.292964 2.300049
C  -3.405343 -3.787213 2.743772
C  -0.866305 3.303253 0.341542
C  0.480287 3.034627 -0.23064
C  1.626465 2.466021 0.41417
C  0.842872 3.216968 -1.522743
C  2.582609 2.344064 -0.535215
C  3.936161 1.733026 -0.528086
C  3.9104 0.355536 -1.149688
C  3.347443 -0.711978 -0.453175
C  4.399881 0.13579 -2.432033
C  3.277819 -1.973188 -1.02488
C  4.331454 -1.127273 -3.008252
C  3.769533 -2.184459 -2.30774
H  -2.145263 -1.116655 2.398321
H  -3.300872 0.314618 -0.08527
H  0.001746 -1.224777 1.297583
H  -0.247045 -2.706062 0.389093
H  0.129258 -1.2130 -0.461937
H  -2.474418 -3.166164 -0.773139
H  -3.580739 -1.82797 -1.061873
H  -2.004634 -1.850824 -1.848391
H  -4.91062 -1.058245 1.223403
H  -6.543896 -2.572737 1.872025
H  -6.125678 -3.450099 3.345504
H  -5.998077 -4.250455 1.794427
H  -2.379039 -3.455554 2.593153
H  -3.505558 -4.774913 2.285982
H  -3.556481 -3.931212 3.817242
H  -0.809662 3.583484 1.393988
H  -1.359089 4.113123 -0.194006
H  1.721028 2.182292 1.449873
H  0.322427 3.622293 -2.377241
H  4.272289 1.670566 0.50832
H  4.648462 2.371901 -1.055795
H  2.956108 -0.553113 0.545593
H  4.839609 0.956522 -2.986615
H  2.838782 -2.792056 -0.46865
H  4.717687 -1.283154 -4.007691
H  3.71669 -3.168431 -2.75591
elementType: O C H
totalener: -1079.75288481 hartree
nucrepener: 2135.32018182 hartree
electener: -3215.07306664 hartree
oneelecener: -5710.12227631 hartree
twoeener: 2495.04920967 hartree
cpcmener: -0.02439535 hartree
kineticenergy: 1074.87109935 hartree
xcener: -106.461548100118 hartree
chargesum: -0.0000000
charge: -0.281453 -0.471532 -0.274943 0.151830 -0.017639 -0.111469 -0.323426 -0.274487 -0.251027 0.409271 -0.041077 -0.228875 -0.248301 0.068758 -0.074536 -0.322453 -0.036617 0.212470 -0.062555 0.062877 -0.219620 -0.193563 -0.163928 -0.153122 -0.166085 0.099242 0.091142 0.095608 0.098640 0.106134 0.096396 0.091850 0.100262 0.119209 0.088745 0.094323 0.093644 0.086693 0.094842 0.101201 0.119157 0.119597 0.156593 0.174088 0.116085 0.107240 0.148183 0.138940 0.160699 0.155932 0.157056
qa: -0.2815 -0.4715 -0.2749 0.1518 -0.0176 -0.1115 -0.3234 -0.2745 -0.2510 0.4093 -0.0411 -0.2289 -0.2483 0.0688 -0.0745 -0.3225 -0.0366 0.2125 -0.0626 0.0629 -0.2196 -0.1936 -0.1639 -0.1531 -0.1661 0.0992 0.0911 0.0956 0.0986 0.1061 0.0964 0.0919 0.1003 0.1192 0.0887 0.0943 0.0936 0.0867 0.0948 0.1012 0.1192 0.1196 0.1566 0.1741 0.1161 0.1072 0.1482 0.1389 0.1607 0.1559 0.1571
va: 2.1258 2.0374 2.2780 3.6725 3.8046 3.8570 3.9029 3.9011 3.8540 4.1936 3.7085 3.9284 3.9373 3.8543 3.6391 3.9839 3.9692 3.6227 3.8259 3.5720 3.9204 3.9579 3.8883 3.8952 3.9010 1.0250 1.0360 1.0171 1.0019 0.9931 1.0011 1.0029 1.0030 1.0072 1.0076 0.9954 0.9965 1.0083 0.9981 0.9986 1.0057 0.9964 1.0199 0.9943 1.0072 1.0118 0.9992 1.0048 0.9885 0.9909 0.9903
dispcorr: -0.024912319 hartree
energy: -1079.777797133479
dipole: -17.65045 17.26995 -0.38050 -23.79093 23.48368 -0.30724 6.30499 -6.83697 -0.53198
magnitude: 0.72262 au
magnitude: 1.83676 debye
