program: Orca
programVersion: 5.0.2
elementType: O O O C C C C C C C C C C C C C C C C C C C C C C H H H H H H H H H H H H H H H H H H H H H H H H H H
charge: 0
multiplicity: 1
keywords: wb97x-d3
keywords: def2-TZVPP
keywords: def2/J RIJCOSX
keywords: DEFGRID2
keywords: scfconv7
keywords: smallprint printgap noloewdin
keywords: NOSOSCF
formula: C22H26O3
InChI: InChI=1/C22H26O3/c1-15(2)10-19-20(22(19,3)4)21(23)25-14-17-12-18(24-13-17)11-16-8-6-5-7-9-16/h5-10,12-13,19-20H,11,14H2,1-4H3
51 atoms
O  -1.526822 1.723932 0.266794
O  -3.506665 2.674037 0.652382
O  2.419527 2.397096 -1.303814
C  -3.300583 -0.656532 -0.629718
C  -2.521103 -0.932567 0.624087
C  -3.383297 0.310511 0.540609
C  -2.542094 -0.2909 -1.883304
C  -4.551912 -1.45153 -0.917392
C  -2.888615 -2.009887 1.564893
C  -2.831858 1.682149 0.49408
C  -2.073604 -2.953358 2.048867
C  -2.587696 -3.992132 3.000487
C  -0.619012 -3.086506 1.71309
C  -0.890135 3.004103 0.11905
C  0.531284 2.713525 -0.18674
C  1.502967 2.136025 0.693128
C  1.150292 2.845087 -1.382135
C  2.627148 1.960134 -0.038866
C  3.929836 1.309217 0.252194
C  3.987568 -0.071334 -0.361129
C  4.700102 -0.30872 -1.531089
C  3.279793 -1.121936 0.219519
C  4.708343 -1.572344 -2.110012
C  3.287633 -2.383939 -0.354534
C  4.003081 -2.613111 -1.523813
H  -1.45765 -0.748125 0.524664
H  -4.326896 0.27801 1.07554
H  -1.570192 0.156537 -1.686623
H  -2.366516 -1.189923 -2.477826
H  -3.114828 0.402529 -2.503202
H  -4.29888 -2.412691 -1.370245
H  -5.143541 -1.652134 -0.025059
H  -5.192611 -0.915535 -1.620611
H  -3.926384 -2.029679 1.885936
H  -2.443416 -4.998813 2.598476
H  -3.64893 -3.866272 3.215446
H  -2.046222 -3.960167 3.949951
H  -0.007006 -3.036382 2.617734
H  -0.25135 -2.329008 1.023018
H  -0.41936 -4.062859 1.263098
H  -0.995089 3.575347 1.043843
H  -1.358774 3.570413 -0.688342
H  1.36993 1.874047 1.731509
H  0.824064 3.231327 -2.335636
H  4.042737 1.245732 1.335694
H  4.755493 1.921479 -0.118887
H  5.254579 0.498694 -1.994967
H  2.714766 -0.949969 1.129018
H  5.266748 -1.741728 -3.022067
H  2.734061 -3.190001 0.110893
H  4.009567 -3.59733 -1.974541
elementType: O C H
totalener: -1079.75324747 hartree
nucrepener: 2129.45239608 hartree
electener: -3209.20564355 hartree
oneelecener: -5697.42731893 hartree
twoeener: 2488.22167538 hartree
cpcmener: -0.02768766 hartree
kineticenergy: 1074.85492850 hartree
xcener: -106.458666192229 hartree
chargesum: -0.0000000
charge: -0.265670 -0.473749 -0.276555 0.098763 0.078015 -0.115349 -0.271308 -0.271384 -0.291397 0.406374 -0.044698 -0.222829 -0.247893 0.077613 -0.086339 -0.338539 -0.024951 0.210893 -0.066487 0.052997 -0.192708 -0.205199 -0.151270 -0.155404 -0.172490 0.093642 0.089252 0.085723 0.093977 0.099758 0.096195 0.087609 0.098177 0.117123 0.092959 0.088309 0.093455 0.095612 0.080546 0.096030 0.117595 0.110015 0.160119 0.174072 0.115895 0.108997 0.138831 0.142687 0.156267 0.159402 0.157313
qa: -0.2657 -0.4737 -0.2766 0.0988 0.0780 -0.1153 -0.2713 -0.2714 -0.2914 0.4064 -0.0447 -0.2228 -0.2479 0.0776 -0.0863 -0.3385 -0.0250 0.2109 -0.0665 0.0530 -0.1927 -0.2052 -0.1513 -0.1554 -0.1725 0.0936 0.0893 0.0857 0.0940 0.0998 0.0962 0.0876 0.0982 0.1171 0.0930 0.0883 0.0935 0.0956 0.0805 0.0960 0.1176 0.1100 0.1601 0.1741 0.1159 0.1090 0.1388 0.1427 0.1563 0.1594 0.1573
va: 2.1059 2.0329 2.2769 3.6969 3.7204 3.8825 3.9095 3.9122 3.8577 4.1656 3.7697 3.9219 3.9470 3.8510 3.7552 3.9859 3.9469 3.6156 3.8303 3.5932 3.9563 3.9422 3.8949 3.8971 3.9090 1.0175 1.0341 1.0148 1.0013 0.9998 1.0020 1.0062 1.0017 1.0107 0.9961 1.0088 0.9960 0.9967 1.0104 0.9977 0.9943 1.0033 1.0088 0.9953 1.0074 1.0112 1.0052 1.0021 0.9908 0.9892 0.9910
dispcorr: -0.023530087 hartree
energy: -1079.776777561374
dipole: -11.83944 12.88882 1.04938 -21.96450 20.87168 -1.09282 3.32456 -3.44348 -0.11892
magnitude: 1.51974 au
magnitude: 3.86286 debye
