program: Orca
programVersion: 5.0.2
elementType: O O O C C C C C C C C C C C C C C C C C C C C C C H H H H H H H H H H H H H H H H H H H H H H H H H H
charge: 0
multiplicity: 1
keywords: wb97x-d3
keywords: def2-TZVPP
keywords: def2/J RIJCOSX
keywords: DEFGRID2
keywords: scfconv7
keywords: smallprint printgap noloewdin
keywords: NOSOSCF
formula: C22H26O3
InChI: InChI=1/C22H26O3/c1-15(2)10-19-20(22(19,3)4)21(23)25-14-17-12-18(24-13-17)11-16-8-6-5-7-9-16/h5-10,12-13,19-20H,11,14H2,1-4H3
51 atoms
O  -1.521679 1.508522 0.315829
O  -3.450851 2.529599 0.7714
O  2.49514 2.355603 -1.16369
C  -3.374636 -0.746784 -0.7224
C  -2.67303 -1.115313 0.541355
C  -3.459092 0.183848 0.479391
C  -2.554689 -0.374852 -1.934771
C  -4.667334 -1.439251 -1.082279
C  -3.123764 -2.223127 1.421503
C  -2.829154 1.517004 0.5382
C  -2.767324 -2.371039 2.700364
C  -3.22359 -3.547959 3.507339
C  -1.892825 -1.398767 3.430171
C  -0.827152 2.766241 0.299152
C  0.582458 2.466935 -0.04839
C  1.525196 1.705801 0.715809
C  1.232669 2.82844 -1.177982
C  2.66741 1.669018 -0.009497
C  3.978348 1.004237 0.19998
C  4.174118 -0.177057 -0.721681
C  5.08826 -0.127814 -1.767477
C  3.425811 -1.337921 -0.538048
C  5.259387 -1.219657 -2.610294
C  3.594871 -2.429174 -1.375949
C  4.514875 -2.373424 -2.416198
H  -1.596279 -0.976832 0.507976
H  -4.424451 0.180312 0.973329
H  -3.067302 0.372231 -2.544359
H  -1.567431 0.010105 -1.688936
H  -2.407962 -1.258827 -2.558862
H  -5.290087 -1.649532 -0.212887
H  -5.254572 -0.818195 -1.76152
H  -4.471667 -2.386066 -1.590195
H  -3.764247 -2.979247 0.976448
H  -3.842944 -4.231325 2.926347
H  -3.800575 -3.22737 4.37887
H  -2.371326 -4.113376 3.893925
H  -0.957449 -1.873259 3.73512
H  -2.379434 -1.061762 4.348068
H  -1.643575 -0.516448 2.843769
H  -0.904771 3.237198 1.281695
H  -1.27334 3.438853 -0.436318
H  1.366763 1.244918 1.678666
H  0.935772 3.40614 -2.039909
H  4.023626 0.676568 1.240297
H  4.791019 1.721998 0.060851
H  5.676515 0.76872 -1.924246
H  2.705262 -1.388656 0.270682
H  5.977171 -1.1666 -3.419188
H  3.009477 -3.325811 -1.216105
H  4.649101 -3.225224 -3.07062
elementType: O C H
totalener: -1079.75237969 hartree
nucrepener: 2104.17638811 hartree
electener: -3183.92876781 hartree
oneelecener: -5646.90351537 hartree
twoeener: 2462.97474756 hartree
cpcmener: -0.02686971 hartree
kineticenergy: 1074.86673939 hartree
xcener: -106.460348287388 hartree
chargesum: 0.0000000
charge: -0.268558 -0.475135 -0.277872 0.146684 -0.008394 -0.090109 -0.266591 -0.297527 -0.299079 0.393135 -0.009753 -0.229528 -0.245266 0.079172 -0.087718 -0.328772 -0.027292 0.206447 -0.067716 0.036361 -0.185811 -0.191605 -0.154813 -0.159040 -0.168812 0.104968 0.090368 0.100866 0.087037 0.093463 0.090043 0.098645 0.099633 0.123179 0.088473 0.095160 0.094027 0.100368 0.095590 0.076960 0.116782 0.108784 0.162252 0.174700 0.117829 0.107801 0.138909 0.141888 0.155986 0.156780 0.157104
qa: -0.2686 -0.4751 -0.2779 0.1467 -0.0084 -0.0901 -0.2666 -0.2975 -0.2991 0.3931 -0.0098 -0.2295 -0.2453 0.0792 -0.0877 -0.3288 -0.0273 0.2064 -0.0677 0.0364 -0.1858 -0.1916 -0.1548 -0.1590 -0.1688 0.1050 0.0904 0.1009 0.0870 0.0935 0.0900 0.0986 0.0996 0.1232 0.0885 0.0952 0.0940 0.1004 0.0956 0.0770 0.1168 0.1088 0.1623 0.1747 0.1178 0.1078 0.1389 0.1419 0.1560 0.1568 0.1571
va: 2.0942 2.0323 2.2772 3.7200 3.7935 3.8435 3.8870 3.9185 3.8804 4.1399 3.7027 3.9301 3.9454 3.8505 3.7468 3.9862 3.9492 3.6262 3.8229 3.6034 3.9495 3.9374 3.8941 3.9105 3.9009 1.0154 1.0305 0.9997 1.0137 1.0019 1.0016 1.0021 0.9987 1.0033 1.0071 0.9963 0.9957 0.9982 0.9991 1.0159 0.9935 1.0050 1.0075 0.9951 1.0058 1.0095 1.0047 1.0036 0.9912 0.9915 0.9907
dispcorr: -0.023028832 hartree
energy: -1079.775408525154
dipole: -14.95297 15.89831 0.94534 -18.01061 16.98686 -1.02375 6.34038 -6.27005 0.07033
magnitude: 1.39523 au
magnitude: 3.54640 debye
