program: Orca
programVersion: 5.0.2
elementType: O O O C C C C C C C C C C C C C C C C C C C C C C H H H H H H H H H H H H H H H H H H H H H H H H H H
charge: 0
multiplicity: 1
keywords: wb97x-d3
keywords: def2-TZVPP
keywords: def2/J RIJCOSX
keywords: DEFGRID2
keywords: scfconv7
keywords: smallprint printgap noloewdin
keywords: NOSOSCF
formula: C22H26O3
InChI: InChI=1/C22H26O3/c1-15(2)10-19-20(22(19,3)4)21(23)25-14-17-12-18(24-13-17)11-16-8-6-5-7-9-16/h5-10,12-13,19-20H,11,14H2,1-4H3
51 atoms
O  -1.765684 2.318268 0.897115
O  -2.204469 1.750391 -1.220793
O  2.561059 2.419924 0.636728
C  -4.057684 -0.415092 0.089697
C  -2.729907 -1.014386 -0.253806
C  -2.792702 0.271255 0.566188
C  -4.88652 0.182643 -1.021211
C  -4.904574 -1.041952 1.17257
C  -2.203684 -2.242466 0.368614
C  -2.249071 1.50144 -0.037647
C  -1.403395 -3.150473 -0.202958
C  -0.958386 -4.362349 0.560946
C  -0.885835 -3.083873 -1.607735
C  -0.948307 3.426969 0.479451
C  0.443978 2.960716 0.24327
C  0.957349 2.226879 -0.877334
C  1.469292 3.041756 1.123975
C  2.240347 1.917893 -0.580371
C  3.258213 1.089943 -1.272423
C  3.559417 -0.185924 -0.517858
C  4.867052 -0.529192 -0.194383
C  2.527876 -1.040877 -0.13134
C  5.143548 -1.701548 0.499235
C  2.80024 -2.209214 0.563901
C  4.110971 -2.544405 0.882212
H  -2.432793 -0.847583 -1.283276
H  -2.589888 0.165775 1.626106
H  -5.482437 1.021718 -0.655077
H  -4.292445 0.534178 -1.861763
H  -5.580747 -0.569028 -1.403958
H  -5.645127 -0.326852 1.536465
H  -5.445117 -1.907779 0.783563
H  -4.324496 -1.37185 2.033835
H  -2.494718 -2.41623 1.400398
H  0.133136 -4.416915 0.611701
H  -1.28823 -5.281289 0.067067
H  -1.342712 -4.37414 1.581483
H  0.20492 -3.158795 -1.618401
H  -1.156637 -2.17354 -2.139219
H  -1.255101 -3.930171 -2.19414
H  -0.983077 4.131842 1.309077
H  -1.376246 3.916533 -0.39569
H  0.436271 1.951993 -1.780329
H  1.560688 3.496884 2.098687
H  4.18214 1.654708 -1.423533
H  2.871855 0.855302 -2.267223
H  5.679664 0.126862 -0.484237
H  1.499694 -0.789854 -0.368803
H  6.168261 -1.951384 0.744169
H  1.986639 -2.859855 0.860632
H  4.323258 -3.455369 1.427296
elementType: O C H
totalener: -1079.75311934 hartree
nucrepener: 2163.30311028 hartree
electener: -3243.05622962 hartree
oneelecener: -5765.76461805 hartree
twoeener: 2522.70838843 hartree
cpcmener: -0.02469432 hartree
kineticenergy: 1074.84450790 hartree
xcener: -106.458679400944 hartree
chargesum: 0.0000000
charge: -0.286803 -0.479059 -0.277146 0.100866 0.021767 -0.068583 -0.273398 -0.277763 -0.257538 0.398447 -0.068145 -0.215845 -0.256527 0.077953 -0.087084 -0.305348 -0.036669 0.197502 -0.044356 0.023954 -0.187075 -0.206604 -0.138955 -0.140930 -0.195033 0.096712 0.087572 0.096945 0.092362 0.093892 0.096171 0.099214 0.089284 0.114862 0.083619 0.100230 0.089362 0.085861 0.094105 0.105599 0.117941 0.116775 0.163449 0.173698 0.102899 0.112773 0.138708 0.145868 0.155188 0.174237 0.155041
qa: -0.2868 -0.4791 -0.2771 0.1009 0.0218 -0.0686 -0.2734 -0.2778 -0.2575 0.3984 -0.0681 -0.2158 -0.2565 0.0780 -0.0871 -0.3053 -0.0367 0.1975 -0.0444 0.0240 -0.1871 -0.2066 -0.1390 -0.1409 -0.1950 0.0967 0.0876 0.0969 0.0924 0.0939 0.0962 0.0992 0.0893 0.1149 0.0836 0.1002 0.0894 0.0859 0.0941 0.1056 0.1179 0.1168 0.1634 0.1737 0.1029 0.1128 0.1387 0.1459 0.1552 0.1742 0.1550
va: 2.1166 2.0217 2.2772 3.7142 3.7855 3.8024 3.8956 3.9153 3.8719 4.1701 3.7718 3.9174 3.9355 3.8415 3.6926 3.9732 3.9693 3.6462 3.8267 3.6664 3.9377 3.9383 3.8880 3.8626 3.9440 1.0275 1.0356 0.9998 1.0212 0.9998 1.0016 1.0004 1.0070 1.0125 0.9978 0.9966 1.0088 0.9988 1.0099 0.9989 0.9972 1.0106 1.0168 0.9950 1.0101 1.0046 1.0036 0.9966 0.9910 0.9757 0.9934
dispcorr: -0.024643981 hartree
energy: -1079.777763319446
dipole: -15.70843 15.74573 0.03731 -20.43058 19.98345 -0.44713 -1.78304 2.31743 0.53439
magnitude: 0.69777 au
magnitude: 1.77360 debye
