program: Orca
programVersion: 5.0.2
elementType: O O O C C C C C C C C C C C C C C C C C C C C C C H H H H H H H H H H H H H H H H H H H H H H H H H H
charge: 0
multiplicity: 1
keywords: wb97x-d3
keywords: def2-TZVPP
keywords: def2/J RIJCOSX
keywords: DEFGRID2
keywords: scfconv7
keywords: smallprint printgap noloewdin
keywords: NOSOSCF
formula: C22H26O3
InChI: InChI=1/C22H26O3/c1-15(2)10-19-20(22(19,3)4)21(23)25-14-17-12-18(24-13-17)11-16-8-6-5-7-9-16/h5-10,12-13,19-20H,11,14H2,1-4H3
51 atoms
O  -1.934894 2.407852 0.721407
O  -1.720048 1.408386 -1.264449
O  2.33446 2.023815 0.917031
C  -3.872567 -0.594373 -0.261048
C  -2.54511 -1.110734 0.189927
C  -2.945573 0.337164 0.492206
C  -4.115508 -0.433698 -1.742737
C  -5.124724 -0.99023 0.486901
C  -2.374605 -2.063791 1.301102
C  -2.158375 1.409831 -0.135243
C  -1.311197 -2.846007 1.519455
C  -1.285839 -3.788055 2.685225
C  -0.076504 -2.876534 0.67066
C  -0.996997 3.428257 0.331981
C  0.395669 2.900123 0.277498
C  1.186306 2.613792 -0.882225
C  1.150884 2.523886 1.336548
C  2.350375 2.085243 -0.440845
C  3.52757 1.507969 -1.137011
C  3.551895 0.001126 -1.022225
C  2.591264 -0.763709 -1.681435
C  4.505384 -0.644706 -0.243567
C  2.587166 -2.14554 -1.567471
C  4.501383 -2.029981 -0.123676
C  3.542131 -2.783765 -0.783978
H  -1.815318 -1.187069 -0.608577
H  -3.231311 0.532537 1.519416
H  -3.202555 -0.316531 -2.320672
H  -4.626059 -1.322229 -2.118936
H  -4.760135 0.423291 -1.946161
H  -4.994705 -0.994163 1.568344
H  -5.932615 -0.292422 0.260274
H  -5.45429 -1.986016 0.184662
H  -3.195528 -2.126342 2.008983
H  -2.19461 -3.729198 3.283716
H  -0.435473 -3.578461 3.339199
H  -1.168272 -4.822195 2.350752
H  -0.089516 -2.16582 -0.153293
H  0.082115 -3.874015 0.250857
H  0.804748 -2.656776 1.279793
H  -1.100273 4.189208 1.103099
H  -1.286802 3.874787 -0.619653
H  0.913709 2.779373 -1.912537
H  0.983132 2.549051 2.402264
H  4.45418 1.926669 -0.737309
H  3.472046 1.80371 -2.185937
H  1.838115 -0.271981 -2.286661
H  5.257869 -0.061821 0.274176
H  1.837067 -2.726682 -2.088272
H  5.251241 -2.518912 0.484815
H  3.539964 -3.862305 -0.694833
elementType: O C H
totalener: -1079.73898020 hartree
nucrepener: 2178.31483946 hartree
electener: -3258.05381966 hartree
oneelecener: -5796.58193564 hartree
twoeener: 2538.52811598 hartree
cpcmener: -0.03047162 hartree
kineticenergy: 1074.85340978 hartree
xcener: -106.461973237076 hartree
chargesum: -0.0000000
charge: -0.295003 -0.505998 -0.283390 0.130105 -0.007062 -0.081771 -0.279788 -0.291534 -0.265121 0.418713 -0.033350 -0.225382 -0.252668 0.090040 -0.080603 -0.309450 -0.044457 0.192522 -0.051324 0.028025 -0.170518 -0.191224 -0.204610 -0.152031 -0.165114 0.107534 0.090981 0.089354 0.095112 0.099345 0.092130 0.098152 0.100767 0.118656 0.089128 0.094322 0.094737 0.075678 0.102080 0.096654 0.124928 0.120983 0.163363 0.178084 0.107366 0.117275 0.145788 0.143640 0.164545 0.160057 0.160337
qa: -0.2950 -0.5060 -0.2834 0.1301 -0.0071 -0.0818 -0.2798 -0.2915 -0.2651 0.4187 -0.0334 -0.2254 -0.2527 0.0900 -0.0806 -0.3094 -0.0445 0.1925 -0.0513 0.0280 -0.1705 -0.1912 -0.2046 -0.1520 -0.1651 0.1075 0.0910 0.0894 0.0951 0.0993 0.0921 0.0982 0.1008 0.1187 0.0891 0.0943 0.0947 0.0757 0.1021 0.0967 0.1249 0.1210 0.1634 0.1781 0.1074 0.1173 0.1458 0.1436 0.1645 0.1601 0.1603
va: 2.1204 1.9931 2.2620 3.6910 3.8181 3.8032 3.8885 3.9188 3.8900 4.1418 3.7966 3.9192 3.9339 3.8210 3.6257 3.9845 3.9616 3.6367 3.8190 3.6058 3.8858 3.9428 3.8815 3.8878 3.8493 1.0130 1.0350 1.0216 0.9996 0.9996 1.0053 1.0009 0.9999 1.0094 1.0083 0.9964 0.9951 1.0084 0.9955 0.9952 0.9950 1.0048 1.0111 0.9934 1.0097 1.0065 1.0036 1.0027 0.9875 0.9893 0.9906
dispcorr: -0.024859503 hartree
energy: -1079.763839701057
dipole: -14.19488 14.03458 -0.16030 -18.89428 18.76205 -0.13222 2.48904 -1.81889 0.67015
magnitude: 0.70163 au
magnitude: 1.78340 debye
