program: Orca
programVersion: 5.0.2
elementType: O O O C C C C C C C C C C C C C C C C C C C C C C H H H H H H H H H H H H H H H H H H H H H H H H H H
charge: 0
multiplicity: 1
keywords: wb97x-d3
keywords: def2-TZVPP
keywords: def2/J RIJCOSX
keywords: DEFGRID2
keywords: scfconv7
keywords: smallprint printgap noloewdin
keywords: NOSOSCF
formula: C22H26O3
InChI: InChI=1/C22H26O3/c1-15(2)10-19-20(22(19,3)4)21(23)25-14-17-12-18(24-13-17)11-16-8-6-5-7-9-16/h5-10,12-13,19-20H,11,14H2,1-4H3
51 atoms
O  -1.710301 2.093331 1.101133
O  -1.923903 1.829432 -1.108176
O  2.125062 2.864804 -0.998223
C  -3.57478 -0.715377 -0.435382
C  -2.142745 -1.131559 -0.465589
C  -2.558464 0.061093 0.38187
C  -4.205792 -0.131862 -1.675486
C  -4.543876 -1.533854 0.384036
C  -1.687398 -2.399556 0.160359
C  -2.053732 1.394882 0.014213
C  -0.725184 -2.548427 1.075017
C  -0.380507 -3.902854 1.615373
C  0.080391 -1.421525 1.643508
C  -0.967789 3.308894 0.90948
C  0.383033 3.004035 0.368763
C  1.332109 2.082726 0.915524
C  0.920247 3.443107 -0.791764
C  2.363083 2.02352 0.040716
C  3.565794 1.151159 -0.028015
C  3.208603 -0.291523 -0.314875
C  2.221265 -0.617722 -1.244042
C  3.859385 -1.323203 0.353888
C  1.891845 -1.941659 -1.493674
C  3.534342 -2.65108 0.103097
C  2.547937 -2.965279 -0.820612
H  -1.620206 -0.858554 -1.381022
H  -2.597485 -0.117942 1.450132
H  -3.486871 0.319814 -2.353264
H  -4.714769 -0.925376 -2.225376
H  -4.954429 0.62056 -1.421937
H  -4.911431 -2.384348 -0.193508
H  -4.094554 -1.922089 1.298089
H  -5.408259 -0.931355 0.669141
H  -2.196454 -3.293777 -0.191526
H  0.664754 -4.149946 1.41111
H  -1.003965 -4.688758 1.1898
H  -0.496707 -3.929981 2.701901
H  -0.060503 -0.482632 1.115905
H  1.145043 -1.664444 1.614626
H  -0.168814 -1.259278 2.695553
H  -0.914104 3.748643 1.904333
H  -1.508218 4.002976 0.263826
H  1.240852 1.513665 1.827904
H  0.574474 4.136356 -1.542456
H  4.113679 1.205473 0.91431
H  4.245041 1.526868 -0.797757
H  1.694161 0.165702 -1.775677
H  4.622622 -1.08707 1.086054
H  1.116374 -2.173968 -2.212365
H  4.048807 -3.439496 0.637381
H  2.287699 -3.998189 -1.012012
elementType: O C H
totalener: -1079.73625113 hartree
nucrepener: 2263.96646540 hartree
electener: -3343.70271654 hartree
oneelecener: -5967.61016314 hartree
twoeener: 2623.90744660 hartree
cpcmener: -0.02873409 hartree
kineticenergy: 1074.86338635 hartree
xcener: -106.467910890652 hartree
chargesum: 0.0000000
charge: -0.295112 -0.498431 -0.282009 0.149182 -0.000762 -0.101436 -0.291357 -0.282256 -0.299602 0.396083 -0.028852 -0.226667 -0.210744 0.095301 -0.063340 -0.372557 -0.031468 0.236657 -0.026975 0.021585 -0.208097 -0.193631 -0.142229 -0.128961 -0.209058 0.102155 0.103582 0.091009 0.093699 0.100643 0.099093 0.090951 0.099204 0.120535 0.091645 0.091028 0.100068 0.038192 0.096781 0.121683 0.122504 0.119118 0.166545 0.178920 0.104963 0.104391 0.139265 0.139246 0.159704 0.158087 0.161719
qa: -0.2951 -0.4984 -0.2820 0.1492 -0.0008 -0.1014 -0.2914 -0.2823 -0.2996 0.3961 -0.0289 -0.2267 -0.2107 0.0953 -0.0633 -0.3726 -0.0315 0.2367 -0.0270 0.0216 -0.2081 -0.1936 -0.1422 -0.1290 -0.2091 0.1022 0.1036 0.0910 0.0937 0.1006 0.0991 0.0910 0.0992 0.1205 0.0916 0.0910 0.1001 0.0382 0.0968 0.1217 0.1225 0.1191 0.1665 0.1789 0.1050 0.1044 0.1393 0.1392 0.1597 0.1581 0.1617
va: 2.1055 1.9977 2.2597 3.7247 3.7714 3.8357 3.8854 3.9034 3.8550 4.1303 3.7420 3.9229 3.8986 3.8397 3.6317 3.9419 3.9448 3.5913 3.8009 3.6478 3.8540 3.9283 3.8117 3.8475 3.8547 1.0213 1.0277 1.0212 1.0007 0.9984 1.0011 1.0040 1.0024 1.0056 0.9971 1.0066 0.9971 1.0181 1.0005 1.0041 0.9900 1.0053 1.0042 0.9929 1.0072 1.0116 1.0110 1.0038 0.9912 0.9902 0.9896
dispcorr: -0.030376698 hartree
energy: -1079.766627832545
dipole: -11.65588 11.86695 0.21107 -18.94388 18.35537 -0.58852 5.45198 -4.13874 1.31324
magnitude: 1.45447 au
magnitude: 3.69698 debye
