program: Orca
programVersion: 5.0.2
elementType: O O O C C C C C C C C C C C C C C C C C C C C C C H H H H H H H H H H H H H H H H H H H H H H H H H H
charge: 0
multiplicity: 1
keywords: wb97x-d3
keywords: def2-TZVPP
keywords: def2/J RIJCOSX
keywords: DEFGRID2
keywords: scfconv7
keywords: smallprint printgap noloewdin
keywords: NOSOSCF
formula: C22H26O3
InChI: InChI=1/C22H26O3/c1-15(2)10-19-20(22(19,3)4)21(23)25-14-17-12-18(24-13-17)11-16-8-6-5-7-9-16/h5-10,12-13,19-20H,11,14H2,1-4H3
51 atoms
O  -1.38939 1.971691 1.531924
O  -2.405497 2.165189 -0.450103
O  1.757319 2.613378 -1.521155
C  -3.998868 -0.392177 0.432373
C  -2.795296 -0.798639 -0.353064
C  -2.645726 0.15774 0.834455
C  -5.028329 0.490308 -0.230881
C  -4.613366 -1.357123 1.419623
C  -2.17365 -2.134508 -0.2905
C  -2.175609 1.521102 0.54959
C  -1.274857 -2.617379 -1.156119
C  -0.71332 -3.99774 -0.99057
C  -0.748758 -1.870407 -2.345335
C  -0.57718 3.12533 1.257478
C  0.501743 2.75912 0.303012
C  1.467888 1.715273 0.483377
C  0.722711 3.259818 -0.93217
C  2.200813 1.666051 -0.652728
C  3.335044 0.813355 -1.10201
C  3.55944 -0.350699 -0.174353
C  4.705127 -0.432303 0.608707
C  2.610458 -1.367954 -0.081549
C  4.903535 -1.508368 1.466462
C  2.802344 -2.440051 0.776095
C  3.951959 -2.513662 1.554267
H  -2.714748 -0.295055 -1.310198
H  -2.228477 -0.277883 1.734826
H  -4.619251 1.106702 -1.027949
H  -5.810438 -0.13295 -0.669142
H  -5.504913 1.148923 0.497806
H  -5.257539 -2.073535 0.90617
H  -3.872371 -1.91907 1.987239
H  -5.23061 -0.815293 2.138735
H  -2.467434 -2.771257 0.538875
H  -0.861145 -4.594554 -1.894611
H  -1.165921 -4.532417 -0.155036
H  0.367089 -3.957716 -0.820765
H  -0.961474 -0.802956 -2.32602
H  -1.164537 -2.277095 -3.271588
H  0.334565 -1.988477 -2.419194
H  -0.171727 3.406642 2.228173
H  -1.177443 3.95857 0.889898
H  1.584799 1.08498 1.35084
H  0.243901 4.038811 -1.504957
H  4.247524 1.412329 -1.172605
H  3.130837 0.448653 -2.113376
H  5.451377 0.35111 0.548638
H  1.710718 -1.317133 -0.684252
H  5.802396 -1.557902 2.067367
H  2.054483 -3.220949 0.835452
H  4.103656 -3.35058 2.223492
elementType: O C H
totalener: -1079.73879186 hartree
nucrepener: 2184.77527996 hartree
electener: -3264.51407182 hartree
oneelecener: -5808.82461325 hartree
twoeener: 2544.31054144 hartree
cpcmener: -0.02991504 hartree
kineticenergy: 1074.83982764 hartree
xcener: -106.460565387741 hartree
chargesum: -0.0000000
charge: -0.297688 -0.502794 -0.288244 0.126251 -0.009720 -0.063518 -0.275862 -0.292576 -0.255754 0.402157 -0.043326 -0.229483 -0.274142 0.107266 -0.101339 -0.311699 -0.026702 0.187626 -0.031941 -0.023467 -0.142806 -0.185648 -0.170811 -0.179199 -0.160618 0.100547 0.091984 0.090812 0.095874 0.098643 0.103130 0.091445 0.098385 0.118772 0.101975 0.092546 0.084307 0.093060 0.116275 0.091309 0.121559 0.116656 0.160079 0.179208 0.101675 0.112398 0.142093 0.160170 0.159121 0.160597 0.161414
qa: -0.2977 -0.5028 -0.2882 0.1263 -0.0097 -0.0635 -0.2759 -0.2926 -0.2558 0.4022 -0.0433 -0.2295 -0.2741 0.1073 -0.1013 -0.3117 -0.0267 0.1876 -0.0319 -0.0235 -0.1428 -0.1856 -0.1708 -0.1792 -0.1606 0.1005 0.0920 0.0908 0.0959 0.0986 0.1031 0.0914 0.0984 0.1188 0.1020 0.0925 0.0843 0.0931 0.1163 0.0913 0.1216 0.1167 0.1601 0.1792 0.1017 0.1124 0.1421 0.1602 0.1591 0.1606 0.1614
va: 2.1046 1.9954 2.2605 3.7428 3.8108 3.8013 3.8878 3.9158 3.8923 4.1449 3.7189 3.9252 3.9371 3.8301 3.7000 3.9594 3.9578 3.6556 3.8228 3.6774 3.8815 3.8944 3.9054 3.9077 3.9054 1.0222 1.0346 1.0205 0.9996 0.9998 0.9994 1.0046 1.0011 1.0101 0.9969 1.0075 0.9960 1.0094 0.9950 0.9952 0.9907 1.0080 1.0057 0.9949 1.0098 1.0047 1.0025 0.9728 0.9901 0.9883 0.9895
dispcorr: -0.025487002 hartree
energy: -1079.764278857407
dipole: -13.42771 13.91171 0.48400 -18.63815 17.75881 -0.87934 -1.92319 2.59946 0.67627
magnitude: 1.21030 au
magnitude: 3.07634 debye
