program: Orca
programVersion: 5.0.2
elementType: O O O C C C C C C C C C C C C C C C C C C C C C C H H H H H H H H H H H H H H H H H H H H H H H H H H
charge: 0
multiplicity: 1
keywords: wb97x-d3
keywords: def2-TZVPP
keywords: def2/J RIJCOSX
keywords: DEFGRID2
keywords: scfconv7
keywords: smallprint printgap noloewdin
keywords: NOSOSCF
formula: C22H26O3
InChI: InChI=1/C22H26O3/c1-15(2)10-19-20(22(19,3)4)21(23)25-14-17-12-18(24-13-17)11-16-8-6-5-7-9-16/h5-10,12-13,19-20H,11,14H2,1-4H3
51 atoms
O  -1.934385 2.248548 0.811508
O  -2.090495 1.68253 -1.34685
O  2.318925 1.951567 0.931424
C  -3.939613 -0.64257 -0.288915
C  -2.534279 -1.115191 -0.415825
C  -2.824582 0.164759 0.353825
C  -4.661508 -0.128258 -1.509614
C  -4.853853 -1.338223 0.690906
C  -1.990973 -2.293789 0.305328
C  -2.272788 1.419247 -0.177659
C  -0.80006 -2.310904 0.91128
C  -0.290822 -3.534341 1.607627
C  0.100682 -1.109045 0.965264
C  -1.037171 3.334972 0.512214
C  0.349391 2.811202 0.372575
C  1.026716 2.379259 -0.815435
C  1.186884 2.522846 1.396295
C  2.215676 1.867986 -0.420441
C  3.330601 1.208329 -1.148589
C  3.366404 -0.276054 -0.871177
C  4.051963 -0.777337 0.231908
C  2.66853 -1.162197 -1.687191
C  4.040753 -2.13718 0.513816
C  2.658252 -2.522476 -1.410357
C  3.342792 -3.014166 -0.306263
H  -2.092752 -0.93334 -1.393779
H  -2.771166 0.081386 1.433014
H  -5.386695 0.641326 -1.238063
H  -3.993605 0.287292 -2.261029
H  -5.212601 -0.945478 -1.979584
H  -5.320238 -2.210369 0.228242
H  -4.327546 -1.676618 1.583698
H  -5.653611 -0.668411 1.011916
H  -2.598376 -3.194909 0.31118
H  -0.048311 -3.318417 2.651401
H  0.635198 -3.885677 1.144265
H  -1.011658 -4.351594 1.588586
H  1.144142 -1.407588 1.076275
H  -0.138944 -0.481814 1.828891
H  0.024338 -0.483442 0.076506
H  -1.119681 4.002527 1.368135
H  -1.361357 3.881157 -0.373603
H  0.671344 2.444748 -1.83134
H  1.113676 2.663899 2.463632
H  4.284415 1.665433 -0.87234
H  3.186712 1.387959 -2.214427
H  4.605625 -0.101659 0.873216
H  2.128254 -0.784212 -2.547403
H  4.580191 -2.511812 1.374324
H  2.115268 -3.199202 -2.057593
H  3.336413 -4.074473 -0.089233
elementType: O C H
totalener: -1079.73810027 hartree
nucrepener: 2242.74192658 hartree
electener: -3322.48002685 hartree
oneelecener: -5925.22523302 hartree
twoeener: 2602.74520618 hartree
cpcmener: -0.02788019 hartree
kineticenergy: 1074.85402347 hartree
xcener: -106.462615065898 hartree
chargesum: 0.0000000
charge: -0.294441 -0.502577 -0.280400 0.160902 0.009123 -0.082241 -0.283578 -0.283655 -0.341263 0.373502 0.031576 -0.226937 -0.268141 0.080457 -0.073102 -0.301041 -0.043583 0.180963 -0.040148 0.072948 -0.200908 -0.237200 -0.127404 -0.124870 -0.218803 0.101177 0.092387 0.099554 0.089381 0.094561 0.098782 0.092557 0.098371 0.123314 0.102151 0.092011 0.091398 0.088398 0.118089 0.075974 0.123812 0.118068 0.157527 0.175723 0.116678 0.107910 0.140671 0.141737 0.159095 0.159512 0.161986
qa: -0.2944 -0.5026 -0.2804 0.1609 0.0091 -0.0822 -0.2836 -0.2837 -0.3413 0.3735 0.0316 -0.2269 -0.2681 0.0805 -0.0731 -0.3010 -0.0436 0.1810 -0.0401 0.0729 -0.2009 -0.2372 -0.1274 -0.1249 -0.2188 0.1012 0.0924 0.0996 0.0894 0.0946 0.0988 0.0926 0.0984 0.1233 0.1022 0.0920 0.0914 0.0884 0.1181 0.0760 0.1238 0.1181 0.1575 0.1757 0.1167 0.1079 0.1407 0.1417 0.1591 0.1595 0.1620
va: 2.1017 1.9886 2.2554 3.7006 3.7763 3.8184 3.8876 3.9058 3.9103 4.1605 3.6745 3.9226 3.9536 3.8353 3.6309 3.9600 3.9311 3.6425 3.8023 3.5338 3.9467 3.9026 3.8494 3.7970 3.8753 1.0268 1.0349 0.9989 1.0199 1.0008 1.0003 1.0023 1.0028 1.0051 0.9950 0.9954 1.0073 1.0092 1.0018 1.0004 0.9962 1.0089 1.0169 0.9938 1.0055 1.0121 1.0095 1.0048 0.9898 0.9893 0.9901
dispcorr: -0.029536922 hartree
energy: -1079.767637191850
dipole: -12.20429 12.42801 0.22371 -15.80038 15.51676 -0.28362 2.44552 -1.58508 0.86044
magnitude: 0.93319 au
magnitude: 2.37199 debye
