program: Orca
programVersion: 5.0.2
elementType: O O O C C C C C C C C C C C C C C C C C C C C C C H H H H H H H H H H H H H H H H H H H H H H H H H H
charge: 0
multiplicity: 1
keywords: wb97x-d3
keywords: def2-TZVPP
keywords: def2/J RIJCOSX
keywords: DEFGRID2
keywords: scfconv7
keywords: smallprint printgap noloewdin
keywords: NOSOSCF
formula: C22H26O3
InChI: InChI=1/C22H26O3/c1-15(2)10-19-20(22(19,3)4)21(23)25-14-17-12-18(24-13-17)11-16-8-6-5-7-9-16/h5-10,12-13,19-20H,11,14H2,1-4H3
51 atoms
O  -1.312107 1.584842 1.1122
O  -2.139166 2.024403 -0.915849
O  1.976455 3.063206 -1.347565
C  -1.330409 -1.33432 0.000711
C  -2.36774 -1.140405 1.067865
C  -2.313185 -0.178496 -0.103066
C  0.116467 -1.093553 0.357655
C  -1.496696 -2.431415 -1.023358
C  -3.548492 -2.016109 1.201041
C  -1.919436 1.239511 -0.017494
C  -4.020911 -2.499279 2.353402
C  -5.244678 -3.362505 2.3853
C  -3.381295 -2.212267 3.686347
C  -0.677271 2.878714 1.166091
C  0.56753 2.859412 0.355313
C  1.756762 2.115602 0.642197
C  0.763039 3.413648 -0.863492
C  2.572298 2.259917 -0.426997
C  3.853125 1.600812 -0.801272
C  3.590412 0.169561 -1.210599
C  2.931638 -0.115299 -2.405477
C  3.931962 -0.882067 -0.366909
C  2.617857 -1.423239 -2.744897
C  3.620893 -2.193378 -0.705834
C  2.960296 -2.467856 -1.894427
H  -1.973286 -0.753214 2.001242
H  -3.077646 -0.326155 -0.85844
H  0.245184 -0.434493 1.21306
H  0.588484 -2.0452 0.609688
H  0.665888 -0.670625 -0.4865
H  -2.523436 -2.540541 -1.369342
H  -0.873686 -2.22895 -1.896849
H  -1.179408 -3.390198 -0.608253
H  -4.072999 -2.266781 0.283733
H  -5.022248 -4.342364 2.815743
H  -5.666054 -3.517215 1.392119
H  -6.019734 -2.919827 3.016504
H  -3.49214 -1.163899 3.971694
H  -2.313002 -2.431998 3.688498
H  -3.836983 -2.807729 4.476801
H  -0.462977 3.03003 2.222171
H  -1.362643 3.662173 0.842624
H  1.9591 1.520683 1.519217
H  0.15906 4.055443 -1.485219
H  4.53648 1.622244 0.048664
H  4.333129 2.152847 -1.611826
H  2.657237 0.691451 -3.07515
H  4.442459 -0.674848 0.566088
H  2.105612 -1.628215 -3.676176
H  3.894253 -2.999792 -0.037696
H  2.714348 -3.48812 -2.158256
elementType: O C H
totalener: -1079.73569308 hartree
nucrepener: 2195.46090746 hartree
electener: -3275.19660055 hartree
oneelecener: -5830.25245659 hartree
twoeener: 2555.05585604 hartree
cpcmener: -0.03124940 hartree
kineticenergy: 1074.85983204 hartree
xcener: -106.464042736695 hartree
chargesum: 0.0000000
charge: -0.283047 -0.500578 -0.281587 0.171086 0.073425 -0.126089 -0.320452 -0.289542 -0.332784 0.426520 -0.006359 -0.225982 -0.287148 0.071601 -0.048569 -0.405084 -0.021354 0.247094 -0.038282 -0.009148 -0.156157 -0.170272 -0.177845 -0.168797 -0.162258 0.100834 0.089124 0.099881 0.107238 0.077463 0.092454 0.094058 0.097969 0.120116 0.096366 0.085679 0.098391 0.104283 0.102813 0.096037 0.120894 0.120456 0.166118 0.177166 0.105345 0.110378 0.139335 0.141338 0.159003 0.159259 0.159608
qa: -0.2830 -0.5006 -0.2816 0.1711 0.0734 -0.1261 -0.3205 -0.2895 -0.3328 0.4265 -0.0064 -0.2260 -0.2871 0.0716 -0.0486 -0.4051 -0.0214 0.2471 -0.0383 -0.0091 -0.1562 -0.1703 -0.1778 -0.1688 -0.1623 0.1008 0.0891 0.0999 0.1072 0.0775 0.0925 0.0941 0.0980 0.1201 0.0964 0.0857 0.0984 0.1043 0.1028 0.0960 0.1209 0.1205 0.1661 0.1772 0.1053 0.1104 0.1393 0.1413 0.1590 0.1593 0.1596
va: 2.1118 1.9931 2.2672 3.6018 3.7382 3.8535 3.9343 3.9173 3.8940 4.1640 3.6933 3.9208 3.9433 3.8465 3.6211 3.9578 3.9632 3.5653 3.8100 3.6596 3.8633 3.8798 3.8817 3.8621 3.8376 1.0187 1.0352 1.0140 0.9960 1.0004 1.0082 1.0023 1.0009 1.0108 0.9930 1.0100 0.9926 0.9954 0.9961 1.0044 0.9947 1.0077 1.0059 0.9985 1.0100 1.0151 1.0117 1.0029 0.9915 0.9908 0.9901
dispcorr: -0.027389084 hartree
energy: -1079.763082166447
dipole: -12.65212 13.36409 0.71197 -22.37961 21.40432 -0.97529 10.61640 -9.27477 1.34164
magnitude: 1.80502 au
magnitude: 4.58799 debye
