program: Orca
programVersion: 5.0.2
elementType: O O O C C C C C C C C C C C C C C C C C C C C C C H H H H H H H H H H H H H H H H H H H H H H H H H H
charge: 0
multiplicity: 1
keywords: wb97x-d3
keywords: def2-TZVPP
keywords: def2/J RIJCOSX
keywords: DEFGRID2
keywords: scfconv7
keywords: smallprint printgap noloewdin
keywords: NOSOSCF
formula: C22H26O3
InChI: InChI=1/C22H26O3/c1-15(2)10-19-20(22(19,3)4)21(23)25-14-17-12-18(24-13-17)11-16-8-6-5-7-9-16/h5-10,12-13,19-20H,11,14H2,1-4H3
51 atoms
O  -1.585032 1.559333 -0.186629
O  -2.035371 -0.423421 -1.12279
O  2.399375 -0.131715 -1.198391
C  -4.635236 0.037869 0.658887
C  -3.801561 -1.090952 1.190441
C  -3.144649 0.235161 0.896425
C  -5.182701 -0.069231 -0.741964
C  -5.552814 0.77567 1.601394
C  -3.914404 -1.547811 2.595416
C  -2.212573 0.383704 -0.237852
C  -4.432858 -2.712528 2.996209
C  -4.503239 -3.06763 4.450727
C  -4.996915 -3.747156 2.070553
C  -0.659418 1.880906 -1.240203
C  0.670125 1.249677 -1.028547
C  1.714459 1.696239 -0.1526
C  1.148418 0.136595 -1.631889
C  2.739482 0.824456 -0.294253
C  4.094949 0.736517 0.308679
C  5.176944 0.668037 -0.741097
C  5.817749 -0.533291 -1.024285
C  5.524599 1.803307 -1.470176
C  6.790381 -0.602112 -2.014842
C  6.494805 1.738047 -2.459838
C  7.130654 0.533345 -2.736305
H  -3.594869 -1.866229 0.459073
H  -2.906696 0.857851 1.752603
H  -6.180442 -0.510805 -0.708726
H  -5.276313 0.914107 -1.206688
H  -4.575612 -0.694975 -1.39277
H  -5.798259 1.761288 1.202109
H  -6.488947 0.22888 1.729023
H  -5.114644 0.918524 2.587805
H  -3.55427 -0.860907 3.356341
H  -3.964282 -3.996466 4.654671
H  -5.537336 -3.237924 4.761626
H  -4.084237 -2.288017 5.08672
H  -4.499568 -4.70947 2.215222
H  -4.917085 -3.483014 1.017636
H  -6.055068 -3.913647 2.289024
H  -0.576831 2.965747 -1.204837
H  -1.076854 1.60825 -2.209452
H  1.698937 2.5643 0.488396
H  0.73425 -0.533083 -2.36953
H  4.160716 -0.138174 0.961918
H  4.231487 1.613554 0.943351
H  5.55658 -1.423066 -0.463817
H  5.031294 2.745598 -1.261017
H  7.279895 -1.544864 -2.223125
H  6.756543 2.628694 -3.016595
H  7.887039 0.481711 -3.508938
elementType: O C H
totalener: -1079.74086134 hartree
nucrepener: 2019.67145928 hartree
electener: -3099.41232062 hartree
oneelecener: -5478.96495853 hartree
twoeener: 2379.55263791 hartree
cpcmener: -0.03113137 hartree
kineticenergy: 1074.84141296 hartree
xcener: -106.457685108161 hartree
chargesum: 0.0000000
charge: -0.288812 -0.503333 -0.287268 0.141986 0.011519 -0.141240 -0.288324 -0.264418 -0.279172 0.435061 -0.035310 -0.227663 -0.252287 0.085857 -0.085413 -0.337271 -0.015189 0.187668 -0.032736 0.029184 -0.183020 -0.199095 -0.164555 -0.161491 -0.170763 0.091902 0.092634 0.097017 0.101755 0.090572 0.098426 0.096392 0.090537 0.123651 0.094727 0.094181 0.089927 0.096676 0.089275 0.096801 0.124139 0.121187 0.164407 0.174435 0.107672 0.117310 0.143263 0.146137 0.160768 0.161011 0.161283
qa: -0.2888 -0.5033 -0.2873 0.1420 0.0115 -0.1412 -0.2883 -0.2644 -0.2792 0.4351 -0.0353 -0.2277 -0.2523 0.0859 -0.0854 -0.3373 -0.0152 0.1877 -0.0327 0.0292 -0.1830 -0.1991 -0.1646 -0.1615 -0.1708 0.0919 0.0926 0.0970 0.1018 0.0906 0.0984 0.0964 0.0905 0.1237 0.0947 0.0942 0.0899 0.0967 0.0893 0.0968 0.1241 0.1212 0.1644 0.1744 0.1077 0.1173 0.1433 0.1461 0.1608 0.1610 0.1613
va: 2.1188 1.9982 2.2673 3.6726 3.7678 3.8907 3.9054 3.9054 3.8706 4.1507 3.7157 3.9237 3.9430 3.8136 3.6108 4.0073 3.9446 3.6411 3.8033 3.5908 3.9364 3.9341 3.8949 3.8958 3.8891 1.0304 1.0382 1.0009 0.9992 1.0175 1.0027 1.0030 1.0032 1.0073 0.9958 0.9960 1.0079 0.9978 1.0085 0.9971 0.9935 1.0110 1.0059 1.0018 1.0032 1.0055 1.0039 1.0025 0.9899 0.9899 0.9893
dispcorr: -0.021774302 hartree
energy: -1079.762635638125
dipole: -29.01740 28.60096 -0.41644 -9.14103 9.98574 0.84471 14.06072 -13.16614 0.89459
magnitude: 1.29894 au
magnitude: 3.30164 debye
