program: Orca
programVersion: 5.0.2
elementType: O O O C C C C C C C C C C C C C C C C C C C C C C H H H H H H H H H H H H H H H H H H H H H H H H H H
charge: 0
multiplicity: 1
keywords: wb97x-d3
keywords: def2-TZVPP
keywords: def2/J RIJCOSX
keywords: DEFGRID2
keywords: scfconv7
keywords: smallprint printgap noloewdin
keywords: NOSOSCF
formula: C22H26O3
InChI: InChI=1/C22H26O3/c1-15(2)10-19-20(22(19,3)4)21(23)25-14-17-12-18(24-13-17)11-16-8-6-5-7-9-16/h5-10,12-13,19-20H,11,14H2,1-4H3
51 atoms
O  -1.843011 2.162641 0.893081
O  -2.249219 1.699873 -1.258292
O  2.522537 2.338571 0.778583
C  -4.107928 -0.565124 -0.112562
C  -2.755048 -1.113486 -0.392803
C  -2.89034 0.150233 0.450609
C  -4.910684 0.040394 -1.237229
C  -4.965383 -1.24885 0.925303
C  -2.21182 -2.350227 0.220267
C  -2.323504 1.39566 -0.08694
C  -0.924568 -2.484371 0.552956
C  -0.376448 -3.758335 1.113663
C  0.053108 -1.355578 0.375264
C  -1.002363 3.279019 0.544407
C  0.39872 2.821643 0.340685
C  0.97256 2.155448 -0.794072
C  1.390213 2.898897 1.258382
C  2.258963 1.882038 -0.474649
C  3.349974 1.171011 -1.193459
C  3.460661 -0.280928 -0.785075
C  3.93327 -0.637168 0.477084
C  3.066226 -1.289197 -1.659146
C  4.000433 -1.969893 0.857439
C  3.135808 -2.624754 -1.282551
C  3.59954 -2.969428 -0.021049
H  -2.388755 -0.907911 -1.397018
H  -2.744092 0.017121 1.516292
H  -5.544562 0.850942 -0.872967
H  -4.294897 0.429119 -2.044771
H  -5.566722 -0.720167 -1.664945
H  -5.695024 -0.55096 1.339486
H  -5.518322 -2.07797 0.479302
H  -4.379223 -1.646255 1.754096
H  -2.890338 -3.186535 0.36245
H  0.072362 -3.592221 2.096394
H  0.421668 -4.149604 0.47644
H  -1.140016 -4.529573 1.213546
H  0.132627 -1.051227 -0.670559
H  1.051063 -1.632165 0.714156
H  -0.247302 -0.468722 0.937509
H  -1.061793 3.952513 1.397604
H  -1.395854 3.804177 -0.325618
H  0.492308 1.911203 -1.727836
H  1.43905 3.319342 2.250999
H  4.300262 1.683806 -1.023224
H  3.146084 1.233507 -2.26281
H  4.257234 0.129809 1.170433
H  2.69767 -1.029203 -2.644429
H  4.36925 -2.228408 1.84181
H  2.823863 -3.395756 -1.975375
H  3.65224 -4.008958 0.275627
elementType: O C H
totalener: -1079.73758803 hartree
nucrepener: 2217.29538545 hartree
electener: -3297.03297348 hartree
oneelecener: -5874.16414609 hartree
twoeener: 2577.13117261 hartree
cpcmener: -0.02735330 hartree
kineticenergy: 1074.84278986 hartree
xcener: -106.460745813333 hartree
chargesum: -0.0000000
charge: -0.294343 -0.507623 -0.286030 0.162666 0.014444 -0.113607 -0.282148 -0.286051 -0.360280 0.409525 0.069594 -0.236668 -0.308541 0.073453 -0.069681 -0.354632 -0.033988 0.244627 -0.046422 0.032799 -0.196365 -0.221579 -0.129894 -0.117184 -0.211488 0.103149 0.097612 0.099927 0.090468 0.094627 0.098208 0.099885 0.092406 0.123560 0.102218 0.095035 0.092875 0.106573 0.083784 0.112257 0.121044 0.118794 0.161448 0.178237 0.117143 0.102529 0.139281 0.141160 0.158492 0.158878 0.159829
qa: -0.2943 -0.5076 -0.2860 0.1627 0.0144 -0.1136 -0.2821 -0.2861 -0.3603 0.4095 0.0696 -0.2367 -0.3085 0.0735 -0.0697 -0.3546 -0.0340 0.2446 -0.0464 0.0328 -0.1964 -0.2216 -0.1299 -0.1172 -0.2115 0.1031 0.0976 0.0999 0.0905 0.0946 0.0982 0.0999 0.0924 0.1236 0.1022 0.0950 0.0929 0.1066 0.0838 0.1123 0.1210 0.1188 0.1614 0.1782 0.1171 0.1025 0.1393 0.1412 0.1585 0.1589 0.1598
va: 2.0987 1.9875 2.2660 3.7136 3.7844 3.8132 3.8855 3.9094 3.9097 4.1218 3.6295 3.9134 3.9721 3.8434 3.6438 3.9568 3.9639 3.5843 3.7992 3.5981 3.9326 3.8957 3.8569 3.8042 3.8763 1.0271 1.0326 0.9990 1.0197 1.0008 1.0029 0.9997 1.0023 1.0045 0.9936 0.9946 1.0091 0.9919 1.0170 1.0040 0.9971 1.0105 1.0200 0.9931 1.0067 1.0132 1.0155 1.0043 0.9905 0.9895 0.9911
dispcorr: -0.028643556 hartree
energy: -1079.766231585848
dipole: -13.06817 13.34864 0.28046 -16.57071 16.19514 -0.37557 1.38230 -0.63020 0.75210
magnitude: 0.88621 au
magnitude: 2.25256 debye
