program: Orca
programVersion: 5.0.2
elementType: O O O C C C C C C C C C C C C C C C C C C C C C C H H H H H H H H H H H H H H H H H H H H H H H H H H
charge: 0
multiplicity: 1
keywords: wb97x-d3
keywords: def2-TZVPP
keywords: def2/J RIJCOSX
keywords: DEFGRID2
keywords: scfconv7
keywords: smallprint printgap noloewdin
keywords: NOSOSCF
formula: C22H26O3
InChI: InChI=1/C22H26O3/c1-15(2)10-19-20(22(19,3)4)21(23)25-14-17-12-18(24-13-17)11-16-8-6-5-7-9-16/h5-10,12-13,19-20H,11,14H2,1-4H3
51 atoms
O  -1.8567 1.981563 0.155362
O  -2.106244 0.526424 -1.527307
O  2.512396 1.57601 0.879031
C  -4.718414 -0.34214 -0.037144
C  -3.59327 -1.189694 0.438688
C  -3.443794 0.328367 0.448676
C  -5.081771 -0.353254 -1.501783
C  -5.915139 -0.146604 0.862722
C  -3.609928 -1.928619 1.726408
C  -2.431098 0.928978 -0.431061
C  -2.522269 -2.179778 2.460377
C  -2.602972 -2.943333 3.745888
C  -1.150307 -1.71242 2.081874
C  -0.72512 2.593074 -0.48609
C  0.537566 1.919759 -0.080304
C  0.977005 0.585892 -0.375175
C  1.509956 2.463375 0.687567
C  2.174174 0.42928 0.235004
C  3.147165 -0.693813 0.264806
C  4.240765 -0.514566 -0.761006
C  4.127878 -1.104242 -2.01682
C  5.357674 0.269304 -0.484582
C  5.11103 -0.916722 -2.978846
C  6.341216 0.460864 -1.4458
C  6.22094 -0.131652 -2.696195
H  -3.026864 -1.6654 -0.35849
H  -3.518979 0.795583 1.423489
H  -5.466027 0.618232 -1.817962
H  -4.249168 -0.615584 -2.149721
H  -5.87122 -1.087644 -1.672439
H  -6.443733 0.771789 0.601684
H  -6.617769 -0.97461 0.750324
H  -5.642578 -0.08176 1.915997
H  -4.570619 -2.296654 2.075555
H  -3.624815 -3.2330 3.9895
H  -2.211095 -2.350411 4.576317
H  -1.994909 -3.850382 3.701666
H  -1.101312 -1.271512 1.088024
H  -0.43723 -2.539667 2.114302
H  -0.787476 -0.967286 2.795152
H  -0.726041 3.627256 -0.145778
H  -0.855331 2.597673 -1.568328
H  0.473624 -0.159744 -0.968819
H  1.61829 3.431102 1.152534
H  2.60129 -1.616564 0.065541
H  3.578152 -0.787105 1.264458
H  3.264442 -1.719132 -2.242537
H  5.463544 0.73004 0.490488
H  5.01079 -1.38716 -3.948569
H  7.204177 1.072814 -1.216837
H  6.98906 0.014833 -3.44435
elementType: O C H
totalener: -1079.73868267 hartree
nucrepener: 2105.36535527 hartree
electener: -3185.10403795 hartree
oneelecener: -5650.05214734 hartree
twoeener: 2464.94810939 hartree
cpcmener: -0.02879888 hartree
kineticenergy: 1074.85769063 hartree
xcener: -106.461187021093 hartree
chargesum: 0.0000000
charge: -0.292493 -0.509587 -0.287794 0.171156 -0.022872 -0.106498 -0.284772 -0.289247 -0.304479 0.419697 -0.002732 -0.230869 -0.232042 0.082368 -0.066826 -0.360013 -0.043646 0.236264 -0.049163 0.046917 -0.200502 -0.208587 -0.154615 -0.157521 -0.178429 0.103881 0.090408 0.100778 0.091169 0.094042 0.098134 0.099725 0.092751 0.124623 0.090093 0.095567 0.096848 0.065768 0.102512 0.103093 0.118967 0.117673 0.167064 0.179145 0.108282 0.117363 0.144600 0.142469 0.160262 0.159984 0.161086
qa: -0.2925 -0.5096 -0.2878 0.1712 -0.0229 -0.1065 -0.2848 -0.2892 -0.3045 0.4197 -0.0027 -0.2309 -0.2320 0.0824 -0.0668 -0.3600 -0.0436 0.2363 -0.0492 0.0469 -0.2005 -0.2086 -0.1546 -0.1575 -0.1784 0.1039 0.0904 0.1008 0.0912 0.0940 0.0981 0.0997 0.0928 0.1246 0.0901 0.0956 0.0968 0.0658 0.1025 0.1031 0.1190 0.1177 0.1671 0.1791 0.1083 0.1174 0.1446 0.1425 0.1603 0.1600 0.1611
va: 2.1076 1.9815 2.2689 3.6813 3.8254 3.8262 3.8846 3.9130 3.8912 4.1054 3.7213 3.9292 3.9353 3.8392 3.6743 3.9918 3.9729 3.6207 3.7963 3.5948 3.9346 3.9577 3.8873 3.8948 3.8955 1.0246 1.0350 0.9985 1.0201 1.0009 1.0027 0.9993 1.0012 1.0035 1.0058 0.9959 0.9961 1.0152 1.0013 0.9974 0.9982 1.0110 1.0176 0.9929 1.0111 1.0099 1.0032 1.0099 0.9899 0.9901 0.9894
dispcorr: -0.024075313 hartree
energy: -1079.762757986219
dipole: -19.89543 19.73107 -0.16436 -12.23603 12.21282 -0.02322 8.19034 -7.15502 1.03532
magnitude: 1.04854 au
magnitude: 2.66518 debye
