program: Orca
programVersion: 5.0.2
elementType: O O O C C C C C C C C C C C C C C C C C C C C C C H H H H H H H H H H H H H H H H H H H H H H H H H H
charge: 0
multiplicity: 1
keywords: wb97x-d3
keywords: def2-TZVPP
keywords: def2/J RIJCOSX
keywords: DEFGRID2
keywords: scfconv7
keywords: smallprint printgap noloewdin
keywords: NOSOSCF
formula: C22H26O3
InChI: InChI=1/C22H26O3/c1-15(2)10-19-20(22(19,3)4)21(23)25-14-17-12-18(24-13-17)11-16-8-6-5-7-9-16/h5-10,12-13,19-20H,11,14H2,1-4H3
51 atoms
O  -1.193924 1.579031 1.265047
O  -0.882662 -0.573633 1.788873
O  2.30281 1.972201 -1.449123
C  -3.463477 -0.744126 -0.071731
C  -3.78406 -1.082867 1.354672
C  -3.030056 0.187169 1.051296
C  -2.444558 -1.5836 -0.801163
C  -4.563724 -0.228249 -0.966221
C  -5.162316 -0.989355 1.890699
C  -1.606722 0.321616 1.413073
C  -5.933415 -2.022038 2.243804
C  -7.319933 -1.805868 2.770603
C  -5.519102 -3.456985 2.134179
C  0.186869 1.886637 1.530593
C  1.051687 1.612176 0.352396
C  1.530353 0.354228 -0.146022
C  1.55466 2.550239 -0.483419
C  2.279678 0.630174 -1.237767
C  3.073778 -0.221229 -2.159974
C  4.556093 0.019257 -2.005241
C  5.253938 -0.565175 -0.950853
C  5.239955 0.852672 -2.883845
C  6.609859 -0.326087 -0.782044
C  6.597918 1.095132 -2.71685
C  7.286547 0.505778 -1.665926
H  -3.174434 -1.882383 1.764397
H  -3.596013 1.110968 1.109349
H  -1.71941 -2.050806 -0.13792
H  -2.951937 -2.385055 -1.341529
H  -1.897534 -0.989153 -1.535955
H  -5.258218 0.427255 -0.442085
H  -4.146686 0.332999 -1.804173
H  -5.138646 -1.059689 -1.379068
H  -5.574528 0.01084 1.990085
H  -7.576038 -0.748488 2.834064
H  -7.435571 -2.242569 3.765766
H  -8.060334 -2.294926 2.132072
H  -4.489457 -3.591742 1.808057
H  -6.161181 -3.982306 1.422155
H  -5.639471 -3.970467 3.091128
H  0.529437 1.352524 2.417189
H  0.193857 2.950967 1.759058
H  1.351188 -0.627701 0.260011
H  1.471047 3.625837 -0.507629
H  2.772168 -0.039524 -3.19478
H  2.834969 -1.262126 -1.937643
H  4.731148 -1.215145 -0.258646
H  4.708931 1.310808 -3.709747
H  7.140541 -0.792322 0.038095
H  7.117665 1.743605 -3.410312
H  8.344694 0.691858 -1.535747
elementType: O C H
totalener: -1079.74093161 hartree
nucrepener: 2041.94939079 hartree
electener: -3121.69032240 hartree
oneelecener: -5523.34529034 hartree
twoeener: 2401.65496795 hartree
cpcmener: -0.02989223 hartree
kineticenergy: 1074.85276713 hartree
xcener: -106.459707684872 hartree
chargesum: 0.0000000
charge: -0.285693 -0.501280 -0.287287 0.150127 0.007754 -0.139168 -0.294887 -0.264822 -0.278956 0.438191 -0.037551 -0.226260 -0.252601 0.067135 -0.078204 -0.323011 -0.034436 0.203907 -0.049308 0.046886 -0.202444 -0.194616 -0.160086 -0.160354 -0.175256 0.094783 0.094241 0.092014 0.098762 0.100314 0.090785 0.098958 0.096592 0.123746 0.089344 0.094996 0.094121 0.089635 0.098025 0.095763 0.122347 0.118560 0.161570 0.179071 0.112925 0.114985 0.146051 0.142808 0.160457 0.160051 0.161315
qa: -0.2857 -0.5013 -0.2873 0.1501 0.0078 -0.1392 -0.2949 -0.2648 -0.2790 0.4382 -0.0376 -0.2263 -0.2526 0.0671 -0.0782 -0.3230 -0.0344 0.2039 -0.0493 0.0469 -0.2024 -0.1946 -0.1601 -0.1604 -0.1753 0.0948 0.0942 0.0920 0.0988 0.1003 0.0908 0.0990 0.0966 0.1237 0.0893 0.0950 0.0941 0.0896 0.0980 0.0958 0.1223 0.1186 0.1616 0.1791 0.1129 0.1150 0.1461 0.1428 0.1605 0.1601 0.1613
va: 2.1207 1.9996 2.2701 3.6674 3.7690 3.8956 3.9039 3.9000 3.8667 4.1363 3.7185 3.9235 3.9431 3.8463 3.6579 3.9956 3.9686 3.6566 3.8103 3.5812 3.9378 3.9472 3.8952 3.8912 3.8924 1.0285 1.0374 1.0159 1.0023 0.9999 1.0031 1.0027 1.0027 1.0071 1.0081 0.9959 0.9959 1.0085 0.9968 0.9979 1.0061 0.9986 1.0190 0.9926 1.0063 1.0081 1.0023 1.0049 0.9900 0.9899 0.9894
dispcorr: -0.022467378 hartree
energy: -1079.763398985893
dipole: -29.70122 28.96944 -0.73178 -14.26486 14.52562 0.26075 2.78285 -3.24741 -0.46455
magnitude: 0.90516 au
magnitude: 2.30072 debye
