program: Orca
programVersion: 5.0.2
elementType: O O O C C C C C C C C C C C C C C C C C C C C C C H H H H H H H H H H H H H H H H H H H H H H H H H H
charge: 0
multiplicity: 1
keywords: wb97x-d3
keywords: def2-TZVPP
keywords: def2/J RIJCOSX
keywords: DEFGRID2
keywords: scfconv7
keywords: smallprint printgap noloewdin
keywords: NOSOSCF
formula: C22H26O3
InChI: InChI=1/C22H26O3/c1-15(2)10-19-20(22(19,3)4)21(23)25-14-17-12-18(24-13-17)11-16-8-6-5-7-9-16/h5-10,12-13,19-20H,11,14H2,1-4H3
51 atoms
O  -1.218421 1.518731 1.226242
O  -0.933161 -0.651068 1.690205
O  2.271717 1.890914 -1.476851
C  -3.520531 -0.744266 -0.163731
C  -3.83878 -1.117297 1.254837
C  -3.071917 0.156213 0.976512
C  -2.509904 -1.577227 -0.913602
C  -4.607866 -0.193927 -1.054533
C  -5.203633 -1.019693 1.81086
C  -1.646444 0.263359 1.34056
C  -5.850837 -1.957265 2.510617
C  -7.239687 -1.709075 3.019411
C  -5.299345 -3.308003 2.849509
C  0.163879 1.804713 1.50924
C  1.037693 1.533622 0.33696
C  1.560105 0.281302 -0.129611
C  1.50521 2.46693 -0.524681
C  2.297869 0.554705 -1.229825
C  3.114083 -0.292929 -2.134867
C  4.58578 0.032329 -2.045725
C  5.316648 -0.329241 -0.915913
C  5.230229 0.712263 -3.07284
C  6.665732 -0.022829 -0.818657
C  6.582001 1.021753 -2.978211
C  7.303302 0.655037 -1.85127
H  -3.229921 -1.927293 1.64195
H  -3.627429 1.084012 1.061343
H  -1.78636 -2.064454 -0.263273
H  -3.02418 -2.362205 -1.47144
H  -1.960587 -0.969269 -1.635729
H  -5.193759 -1.007828 -1.486305
H  -5.29436 0.467749 -0.528548
H  -4.173638 0.373231 -1.879706
H  -5.723396 -0.083114 1.629527
H  -7.599799 -0.712096 2.7663
H  -7.284723 -1.819064 4.105988
H  -7.943973 -2.43695 2.607912
H  -4.292898 -3.480846 2.473006
H  -5.943581 -4.092242 2.443361
H  -5.282257 -3.454934 3.932472
H  0.490759 1.25454 2.391901
H  0.180084 2.86571 1.751605
H  1.416516 -0.694873 0.303937
H  1.385105 3.53817 -0.575368
H  2.773131 -0.180116 -3.167329
H  2.940764 -1.333683 -1.856388
H  4.825006 -0.857274 -0.106782
H  4.673011 0.998261 -3.957026
H  7.221716 -0.315254 0.062911
H  7.070582 1.549377 -3.787211
H  8.356139 0.89415 -1.776395
elementType: O C H
totalener: -1079.74168179 hartree
nucrepener: 2038.11830204 hartree
electener: -3117.85998383 hartree
oneelecener: -5515.69882759 hartree
twoeener: 2397.83884376 hartree
cpcmener: -0.03010558 hartree
kineticenergy: 1074.84824238 hartree
xcener: -106.459636089554 hartree
chargesum: 0.0000000
charge: -0.285127 -0.502346 -0.287103 0.110239 0.040244 -0.109050 -0.280221 -0.270161 -0.285528 0.433307 -0.051193 -0.219689 -0.252591 0.065449 -0.077080 -0.321536 -0.034486 0.205355 -0.048744 0.030156 -0.195125 -0.186007 -0.163287 -0.161763 -0.172707 0.090596 0.092945 0.091072 0.099145 0.099340 0.097703 0.089710 0.098276 0.121362 0.088876 0.093320 0.093867 0.090302 0.096488 0.096147 0.122472 0.119015 0.160315 0.179228 0.110395 0.117993 0.145726 0.143339 0.160686 0.159481 0.161198
qa: -0.2851 -0.5023 -0.2871 0.1102 0.0402 -0.1091 -0.2802 -0.2702 -0.2855 0.4333 -0.0512 -0.2197 -0.2526 0.0654 -0.0771 -0.3215 -0.0345 0.2054 -0.0487 0.0302 -0.1951 -0.1860 -0.1633 -0.1618 -0.1727 0.0906 0.0929 0.0911 0.0991 0.0993 0.0977 0.0897 0.0983 0.1214 0.0889 0.0933 0.0939 0.0903 0.0965 0.0961 0.1225 0.1190 0.1603 0.1792 0.1104 0.1180 0.1457 0.1433 0.1607 0.1595 0.1612
va: 2.1209 1.9984 2.2684 3.6919 3.7660 3.8398 3.9044 3.9041 3.8659 4.1395 3.7585 3.9200 3.9411 3.8478 3.6489 3.9880 3.9689 3.6474 3.8085 3.6009 3.9328 3.9393 3.9001 3.8914 3.8901 1.0337 1.0355 1.0169 1.0014 1.0000 1.0017 1.0057 1.0019 1.0096 1.0088 0.9963 0.9961 1.0099 0.9970 0.9967 1.0059 0.9987 1.0196 0.9928 1.0064 1.0065 1.0026 1.0034 0.9901 0.9903 0.9892
dispcorr: -0.022079251 hartree
energy: -1079.763761041924
dipole: -29.22043 28.55563 -0.66480 -13.50537 13.82382 0.31845 4.33853 -4.67714 -0.33861
magnitude: 0.81119 au
magnitude: 2.06189 debye
