program: Orca
programVersion: 5.0.2
elementType: O O O C C C C C C C C C C C C C C C C C C C C C C H H H H H H H H H H H H H H H H H H H H H H H H H H
charge: 0
multiplicity: 1
keywords: wb97x-d3
keywords: def2-TZVPP
keywords: def2/J RIJCOSX
keywords: DEFGRID2
keywords: scfconv7
keywords: smallprint printgap noloewdin
keywords: NOSOSCF
formula: C22H26O3
InChI: InChI=1/C22H26O3/c1-15(2)10-19-20(22(19,3)4)21(23)25-14-17-12-18(24-13-17)11-16-8-6-5-7-9-16/h5-10,12-13,19-20H,11,14H2,1-4H3
51 atoms
O  -1.910798 2.249414 0.801332
O  -1.922917 1.702284 -1.367724
O  2.30654 2.02962 1.043553
C  -3.549339 -0.819916 -0.507173
C  -2.100904 -1.139425 -0.370239
C  -2.65816 0.124666 0.276967
C  -4.10407 -0.441675 -1.858616
C  -4.540255 -1.587439 0.335843
C  -1.599253 -2.248721 0.481178
C  -2.153527 1.415908 -0.213028
C  -0.564391 -2.165717 1.322175
C  -0.126459 -3.342952 2.137593
C  0.231113 -0.912842 1.53301
C  -1.051516 3.382947 0.556409
C  0.355369 2.910449 0.446437
C  1.058564 2.488823 -0.729251
C  1.168049 2.609211 1.486859
C  2.229139 1.954619 -0.312011
C  3.302956 1.215692 -1.023796
C  3.087531 -0.276947 -0.905821
C  2.045092 -0.886705 -1.602187
C  3.881136 -1.055754 -0.071883
C  1.803126 -2.245278 -1.469921
C  3.641319 -2.418969 0.063461
C  2.601502 -3.017471 -0.633241
H  -1.51194 -0.943286 -1.264928
H  -2.776167 0.073189 1.353063
H  -4.93276 0.262077 -1.759472
H  -3.363903 -0.002382 -2.522559
H  -4.492805 -1.335722 -2.350621
H  -4.153319 -1.823326 1.327276
H  -5.456955 -1.009791 0.467136
H  -4.809688 -2.527508 -0.149746
H  -2.114302 -3.201178 0.385619
H  -0.144371 -3.106692 3.204753
H  0.905174 -3.617244 1.900958
H  -0.755783 -4.217497 1.974442
H  0.093224 -0.18101 0.740326
H  1.297139 -1.142484 1.593911
H  -0.036761 -0.436927 2.480677
H  -1.188364 4.023126 1.425753
H  -1.373237 3.936217 -0.325702
H  0.728875 2.563068 -1.753132
H  1.074304 2.742581 2.553712
H  4.28568 1.487491 -0.632784
H  3.280791 1.514443 -2.073024
H  1.412114 -0.291268 -2.250647
H  4.69409 -0.596187 0.477622
H  0.989026 -2.702315 -2.017915
H  4.268192 -3.012125 0.716867
H  2.413124 -4.077994 -0.527277
elementType: O C H
totalener: -1079.73739094 hartree
nucrepener: 2283.58860656 hartree
electener: -3363.32599749 hartree
oneelecener: -6006.95134887 hartree
twoeener: 2643.62535138 hartree
cpcmener: -0.02774695 hartree
kineticenergy: 1074.84926538 hartree
xcener: -106.463276931866 hartree
chargesum: 0.0000000
charge: -0.294146 -0.500418 -0.279191 0.160616 0.003315 -0.092617 -0.290446 -0.287263 -0.306973 0.385026 -0.016345 -0.225443 -0.209646 0.078787 -0.071259 -0.291745 -0.052794 0.186441 -0.046105 0.053798 -0.211963 -0.197839 -0.141700 -0.128753 -0.210460 0.099265 0.093507 0.100585 0.090805 0.094281 0.093214 0.098541 0.099570 0.121980 0.101710 0.091484 0.091118 0.018315 0.101478 0.125439 0.124256 0.118216 0.160252 0.177468 0.107367 0.116460 0.140679 0.140782 0.158993 0.158074 0.163285
qa: -0.2941 -0.5004 -0.2792 0.1606 0.0033 -0.0926 -0.2904 -0.2873 -0.3070 0.3850 -0.0163 -0.2254 -0.2096 0.0788 -0.0713 -0.2917 -0.0528 0.1864 -0.0461 0.0538 -0.2120 -0.1978 -0.1417 -0.1288 -0.2105 0.0993 0.0935 0.1006 0.0908 0.0943 0.0932 0.0985 0.0996 0.1220 0.1017 0.0915 0.0911 0.0183 0.1015 0.1254 0.1243 0.1182 0.1603 0.1775 0.1074 0.1165 0.1407 0.1408 0.1590 0.1581 0.1633
va: 2.1037 1.9923 2.2510 3.7210 3.7770 3.8176 3.8818 3.9057 3.8524 4.1558 3.7230 3.9246 3.9120 3.8437 3.6359 3.9602 3.9196 3.6437 3.8166 3.5631 3.8644 3.9397 3.8147 3.8452 3.8520 1.0229 1.0317 0.9987 1.0211 1.0005 1.0024 1.0028 1.0003 1.0052 0.9961 0.9971 1.0066 1.0145 1.0015 1.0033 0.9961 1.0084 1.0150 0.9931 1.0137 1.0078 1.0066 1.0043 0.9910 0.9899 0.9888
dispcorr: -0.031458101 hartree
energy: -1079.768849036790
dipole: -10.92083 11.08402 0.16319 -16.47153 16.12228 -0.34925 2.94667 -2.05499 0.89168
magnitude: 0.97144 au
magnitude: 2.46920 debye
