program: Orca
programVersion: 5.0.2
elementType: O O O C C C C C C C C C C C C C C C C C C C C C C H H H H H H H H H H H H H H H H H H H H H H H H H H
charge: 0
multiplicity: 1
keywords: wb97x-d3
keywords: def2-TZVPP
keywords: def2/J RIJCOSX
keywords: DEFGRID2
keywords: scfconv7
keywords: smallprint printgap noloewdin
keywords: NOSOSCF
formula: C22H26O3
InChI: InChI=1/C22H26O3/c1-15(2)10-19-20(22(19,3)4)21(23)25-14-17-12-18(24-13-17)11-16-8-6-5-7-9-16/h5-10,12-13,19-20H,11,14H2,1-4H3
51 atoms
O  -1.684777 2.243881 0.112282
O  -1.089344 1.23889 2.025025
O  2.201623 3.361185 -1.536135
C  -1.448693 -1.258126 0.123465
C  -2.539119 -1.216524 1.152635
C  -2.25905 0.015669 0.334019
C  -0.015091 -1.345017 0.587041
C  -1.694467 -1.985249 -1.174823
C  -3.826782 -1.929267 0.965496
C  -1.623698 1.199221 0.938459
C  -4.145832 -3.091945 1.540933
C  -5.481979 -3.731975 1.31664
C  -3.223107 -3.848155 2.447211
C  -0.89345 3.40981 0.409002
C  0.474213 3.232984 -0.147001
C  1.502995 2.342343 0.301997
C  0.958969 3.820597 -1.265537
C  2.522085 2.451095 -0.581549
C  3.808851 1.712839 -0.717837
C  3.559679 0.243824 -0.965598
C  2.939406 -0.176047 -2.141887
C  3.902412 -0.708574 -0.012751
C  2.669589 -1.518852 -2.358475
C  3.634993 -2.056258 -0.2280
C  3.018142 -2.465156 -1.400977
H  -2.176498 -1.170375 2.175437
H  -2.959099 0.238094 -0.464601
H  0.140805 -0.943342 1.585501
H  0.295017 -2.391098 0.610004
H  0.653442 -0.821493 -0.099086
H  -1.531299 -3.057211 -1.04771
H  -2.707719 -1.845874 -1.549043
H  -1.003486 -1.636807 -1.944979
H  -4.555824 -1.460281 0.310519
H  -6.123704 -3.130784 0.672708
H  -6.005668 -3.888807 2.263363
H  -5.3720 -4.718895 0.85986
H  -3.626483 -3.895262 3.462477
H  -2.22376 -3.418956 2.503355
H  -3.120915 -4.882936 2.110443
H  -0.884757 3.610312 1.47968
H  -1.403109 4.235697 -0.082574
H  1.48363 1.690924 1.161071
H  0.551085 4.556597 -1.941281
H  4.405214 1.837044 0.187613
H  4.389343 2.143014 -1.536664
H  2.662782 0.554461 -2.893716
H  4.38251 -0.395314 0.906923
H  2.187817 -1.82895 -3.277026
H  3.908408 -2.784558 0.524598
H  2.806573 -3.513182 -1.568877
elementType: O C H
totalener: -1079.73823999 hartree
nucrepener: 2177.17115658 hartree
electener: -3256.90939657 hartree
oneelecener: -5793.86005151 hartree
twoeener: 2536.95065494 hartree
cpcmener: -0.02896436 hartree
kineticenergy: 1074.85236042 hartree
xcener: -106.461278359432 hartree
chargesum: -0.0000000
charge: -0.287289 -0.495725 -0.282182 0.216482 -0.011082 -0.139169 -0.323766 -0.278474 -0.276513 0.423155 -0.032736 -0.229336 -0.252730 0.076796 -0.082968 -0.336896 -0.034516 0.230916 -0.030929 -0.013224 -0.168314 -0.164527 -0.166363 -0.163511 -0.174184 0.098763 0.094161 0.105542 0.105188 0.058897 0.097780 0.095081 0.095644 0.124166 0.089617 0.094480 0.095036 0.101393 0.088261 0.094966 0.120029 0.118027 0.163800 0.179909 0.104070 0.110506 0.142279 0.142139 0.159232 0.158765 0.159352
qa: -0.2873 -0.4957 -0.2822 0.2165 -0.0111 -0.1392 -0.3238 -0.2785 -0.2765 0.4232 -0.0327 -0.2293 -0.2527 0.0768 -0.0830 -0.3369 -0.0345 0.2309 -0.0309 -0.0132 -0.1683 -0.1645 -0.1664 -0.1635 -0.1742 0.0988 0.0942 0.1055 0.1052 0.0589 0.0978 0.0951 0.0956 0.1242 0.0896 0.0945 0.0950 0.1014 0.0883 0.0950 0.1200 0.1180 0.1638 0.1799 0.1041 0.1105 0.1423 0.1421 0.1592 0.1588 0.1594
va: 2.1154 2.0036 2.2718 3.5757 3.7978 3.9003 3.9096 3.9040 3.8712 4.1706 3.6999 3.9268 3.9418 3.8350 3.7101 3.9472 3.9501 3.6325 3.7953 3.6787 3.8722 3.8799 3.8560 3.8684 3.8420 1.0235 1.0380 1.0193 1.0011 1.0084 1.0017 1.0037 1.0036 1.0067 1.0076 0.9949 0.9963 0.9975 1.0075 0.9982 1.0106 0.9979 1.0143 0.9922 1.0076 1.0138 1.0080 1.0025 0.9911 0.9909 0.9910
dispcorr: -0.026856318 hartree
energy: -1079.765096306179
dipole: -14.64011 14.56841 -0.07170 -25.11318 24.66123 -0.45195 3.89012 -4.71933 -0.82921
magnitude: 0.94710 au
magnitude: 2.40733 debye
