program: Gaussian 09
title: 000060575
version: EM64L-G09RevD.01
frameworkgroup: C1[X(C22H27FN2O2)]
method: RPBEPBE
basis: SDD
operation: Freq
keyword: #p
keyword: freq=noraman
keyword: PBEPBE/SDD
title: #p freq=noraman PBEPBE/SDD
converged: YES YES NO NO
title: Mulliken charges:
elementType: F O O N N C C C C C C C C C C C C C C C C C C C C C C H H H H H H H H H H H H H H H H H H H H H H H H H H H
charge: -0.191379 -0.234074 -0.248839 -0.063629 -0.254325 -0.036384 -0.422475 -0.423567 -0.400210 -0.371980 -0.348262 -0.578036 0.189876 0.165399 0.499657 -0.366993 0.237513 -0.289350 -0.412255 -0.415724 -0.368805 -0.239935 -0.195344 -0.229208 -0.228162 -0.243707 -0.502428 0.255239 0.210306 0.216474 0.215110 0.207484 0.180936 0.216890 0.208166 0.186125 0.195897 0.221467 0.221405 0.211008 0.226411 0.225163 0.262447 0.231830 0.232857 0.258863 0.236522 0.238853 0.223472 0.223017 0.226962 0.202216 0.240915 0.196592
chargesum: 0.00000
title: Mulliken charges with hydrogens summed into heavy atoms:
elementType: F O O N N C C C C C C C C C C C C C C C C C C C C C C
charge: -0.191379 -0.234074 -0.248839 -0.063629 -0.254325 0.218855 0.004305 -0.000973 -0.002384 0.022310 0.069102 -0.145623 0.189876 0.165399 0.499657 0.084581 0.237513 -0.026903 -0.180426 -0.182867 -0.109942 -0.003413 0.043510 -0.005736 -0.005146 -0.016745 0.137295
polarizability: 3.12352115e+02 1.07463803e+01 2.60609352e+02 -4.40255213e+00 2.49448376e+00 1.89437809e+02
1716.lowfreq: -7.4401 -2.3323 -0.0012 -0.0008 -0.0004 4.3004 8.4955 16.4169 22.3890
frequency: 6.3181 16.3416 22.2742 23.9037 38.3816 40.7768 51.2319 55.0567 65.8846 77.4117 79.2310 97.1478 114.3279 147.5818 170.1311 194.4660 210.8345 220.6802 232.3199 238.1824 263.9786 275.2323 302.1931 324.1415 347.2307 357.6736 370.8863 385.3228 401.1324 403.4158 446.8924 453.1384 472.8275 489.3617 499.2172 515.1611 539.7616 547.5378 588.7393 597.9889 617.9708 631.2084 667.8428 704.7597 733.9741 742.8760 749.5697 765.1545 768.3355 788.7729 799.6511 817.2851 825.9508 849.7505 852.8417 861.7579 909.8890 916.2747 933.3909 944.8723 952.6601 974.7403 977.1443 982.3771 984.5903 989.9426 992.6340 995.0337 1012.1353 1020.0285 1026.7014 1028.3092 1047.0984 1057.0884 1085.4086 1088.6403 1100.0332 1108.1112 1114.5705 1118.9166 1137.6695 1144.0291 1153.6172 1163.5494 1166.9356 1171.4712 1177.7044 1185.8898 1205.2060 1210.9361 1218.1467 1239.9671 1244.0855 1246.8278 1255.7143 1269.1913 1283.1519 1286.3495 1298.3709 1313.0815 1325.6588 1334.2234 1340.6977 1349.2441 1362.4423 1366.3748 1371.0926 1381.4086 1382.6235 1392.3165 1433.5814 1437.8629 1439.8480 1452.0280 1455.8964 1458.4244 1462.0127 1463.5237 1469.7134 1476.4676 1477.3821 1482.5607 1483.9044 1485.7726 1580.2765 1592.7131 1607.0915 1614.2006 1623.2658 2831.0336 2837.0466 2858.2823 2908.3056 2922.0663 2958.1834 2992.1750 2992.3656 2992.8808 2995.6646 3008.8262 3019.0494 3029.6504 3041.8088 3059.5920 3061.3633 3065.0207 3108.4561 3113.3541 3114.0800 3130.4856 3141.9557 3142.4312 3155.7220 3161.0211 3168.2451 3179.6972
redmass: 3.9364 4.7854 4.0694 3.7201 5.4141 3.5536 3.2403 3.9087 3.7305 3.4631 5.2551 3.4960 4.6409 3.6763 4.7962 3.8944 4.4970 2.8146 1.4142 1.9253 2.7234 4.6612 4.8288 2.4103 4.6092 2.6759 4.1563 3.0728 5.1235 2.8260 3.5401 2.9236 3.9049 4.1300 2.9489 3.6203 5.9236 3.7320 4.3198 4.0449 6.3626 4.4888 4.3803 1.7764 4.6256 3.5026 2.4413 2.5320 1.3548 1.2382 4.4125 1.5550 3.1181 2.6379 1.2517 1.4642 4.7820 1.5294 1.9711 1.4249 3.5010 1.3884 2.0222 1.5777 1.4394 6.2387 1.3307 1.9111 2.1398 2.5407 2.1744 2.0467 3.2071 2.7665 2.1934 2.4635 2.1368 2.2355 1.2883 2.7001 2.2011 1.8378 1.5866 1.3041 1.1475 1.0552 2.1295 1.1137 1.4958 1.2423 2.2532 2.9624 1.5990 1.7081 1.4852 1.3598 1.3184 1.4301 1.3882 1.3862 1.2670 1.3073 1.4435 1.4405 1.3982 8.2286 1.6136 1.6110 5.3347 1.4286 1.1292 2.3739 2.1801 1.0922 1.0726 1.0553 1.0889 1.0958 1.0854 1.1268 1.1716 2.3576 2.2283 1.1043 6.7270 6.0626 8.0821 6.1965 9.1799 1.0717 1.0703 1.0699 1.0525 1.0374 1.1015 1.0621 1.0614 1.1023 1.0607 1.0798 1.0872 1.0869 1.0874 1.1034 1.1024 1.1031 1.0965 1.0868 1.0871 1.0908 1.0958 1.0860 1.0907 1.1015 1.0954 1.1003
irintensity: 0.3495 0.4334 0.1826 0.0843 1.2277 0.8859 8.2991 2.8450 1.3846 2.2203 0.4584 0.4090 1.0554 1.5653 1.2897 1.3609 0.1255 1.4932 4.4727 0.0633 3.1479 0.2992 2.1521 0.4317 10.2762 2.6166 0.4187 4.1409 0.6658 0.0093 2.0898 9.5049 2.6277 3.7814 15.6653 4.2291 1.4926 0.3143 12.5094 15.3767 0.0660 1.1974 14.2866 50.8535 9.9321 34.1016 10.5072 31.7042 64.9818 2.4301 10.4997 0.8607 4.8391 0.5452 0.0378 2.2702 29.2781 3.5376 4.7008 2.8295 2.3467 0.1472 18.3934 7.5313 4.9587 0.0619 0.0577 8.5991 4.1939 1.8405 7.2978 10.2808 22.9838 12.3512 94.7310 53.7028 61.1826 21.4636 2.4056 6.5410 21.9235 13.9234 52.5748 0.3175 3.0594 0.1400 14.0044 0.1823 7.9689 30.6057 0.2107 280.4311 23.5023 29.1741 3.7748 36.6848 1.9942 12.0977 10.0405 1.2162 0.0556 27.6322 16.4377 2.0393 10.3387 0.8302 16.5468 11.0952 0.0704 2.6551 1.0902 15.5853 6.7196 3.7173 14.1139 12.1982 6.2908 11.5650 3.6179 1.4897 7.9369 114.7523 24.2011 8.6443 4.3915 1.5638 85.3602 12.6619 177.8661 40.0230 71.2352 149.9287 58.4126 77.3013 39.2086 19.8242 15.1323 72.5550 20.0460 33.4713 9.4614 49.5445 35.3331 15.3445 27.1825 38.4926 31.1295 11.1303 7.1028 11.4388 45.7788 1.1289 11.4299 26.5536 7.8784 7.9619
temp: 298.150 k
press: 1.00000 atm
elementType: 9 8 8 7 7 6 6 6 6 6 6 6 6 6 6 6 6 6 6 6 6 6 6 6 6 6 6 1 1 1 1 1 1 1 1 1 1 1 1 1 1 1 1 1 1 1 1 1 1 1 1 1 1 1
symmnumber: 1
zpe: 1170461.4 jmol-1
zpe.correction: 0.445805 hartree
zpe.thermalcorrener: 0.472082 hartree
zpe.thermalcorrenthalpy: 0.473027 hartree
zpe.thermalcorrgfe: 0.383406 hartree
zpe.sumelectzpe: -1212.289660 hartree
zpe.sumelectthermal: -1212.263383 hartree
zpe.sumelectthermalent: -1212.262439 hartree
zpe.sumelectthermalfe: -1212.352059 hartree
dipole: 0.8130 5.3435 -1.5305
dipole: 5.6175
quadrupole: -140.9420 -162.6856 -158.5470
quadrupole: 23.1827 -8.4483 1.6779
quadrupole: 13.1162 -8.6274 -4.4888 23.1827 -8.4483 1.6779
hfenergy: -1212.7354657 hartree
pointgroup: C01[X(C22H27F1N2O2)]
dipole: -0.2926669 2.1566779 0.3842714 debye
polarizability: 312.0721167|-11.8012792|259.6802535|-2.8668255|-9.6405494|190.6469065 unknown
InChI: InChI=1S/C22H27FN2O2/c1-27-17-22(26)25(21-10-6-5-9-20(21)23)19-12-15-24(16-13-19)14-11-18-7-3-2-4-8-18/h2-10,19H,11-17H2,1H3
charge 0 multiplicity 1
54 atoms
F  -3.730308 0.922054 -2.181932
O  -3.100931 -2.722962 -0.096754
O  -5.723055 -2.321896 0.535903
N  1.752006 -0.175424 -0.224842
N  -2.581511 -0.450853 0.017278
C  -1.130106 -0.753045 -0.203962
C  -0.489548 0.148878 -1.280247
C  -0.298928 -0.690701 1.098777
C  0.982881 -0.260858 -1.493487
C  1.166993 -1.072033 0.804232
C  3.203217 -0.397637 -0.432468
C  4.069617 0.143385 0.738126
C  -3.006158 0.91784 0.135555
C  -3.488625 -1.530063 0.022134
C  5.555399 -0.000779 0.446007
C  -4.969426 -1.139814 0.159982
C  -3.566367 1.612758 -0.963988
C  -2.860977 1.640465 1.347282
C  6.243175 -1.205061 0.748187
C  6.277935 1.049299 -0.177745
C  -3.973762 2.954171 -0.902055
C  -3.255415 2.993545 1.439808
C  -3.811147 3.650719 0.316939
C  7.613536 -1.356908 0.437867
C  7.648572 0.903404 -0.490016
C  8.321761 -0.302147 -0.183643
C  -7.161202 -2.060636 0.537643
H  -1.127802 -1.801548 -0.560139
H  -0.51632 1.208086 -0.960673
H  -1.043258 0.05897 -2.233246
H  -0.723468 -1.384756 1.847808
H  -0.316048 0.334883 1.513741
H  1.016492 -1.297232 -1.922574
H  1.452017 0.4159 -2.231387
H  1.759441 -0.992135 1.732627
H  1.209414 -2.143931 0.473295
H  3.444092 -1.47935 -0.596969
H  3.499492 0.136657 -1.355233
H  3.797892 1.203588 0.893194
H  3.817384 -0.399661 1.66845
H  -5.318578 -0.737567 -0.819447
H  -5.09051 -0.333875 0.917358
H  -2.449024 1.119027 2.216784
H  5.701962 -2.025275 1.237028
H  5.762381 1.988963 -0.413366
H  -4.400329 3.431991 -1.788952
H  -3.135051 3.531151 2.38576
H  -4.120176 4.698676 0.385988
H  8.128957 -2.292769 0.6828
H  8.191272 1.727952 -0.966624
H  9.385187 -0.416618 -0.42221
H  -7.521668 -1.753627 -0.467987
H  -7.639606 -3.010191 0.822786
H  -7.439672 -1.273206 1.271804
