program: Orca
programVersion: 5.0.2
elementType: O O O C C C C C C C C C C C C C C C C C C C C C C H H H H H H H H H H H H H H H H H H H H H H H H H H
charge: 0
multiplicity: 1
keywords: wb97x-d3
keywords: def2-TZVPP
keywords: def2/J RIJCOSX
keywords: DEFGRID2
keywords: scfconv7
keywords: smallprint printgap noloewdin
keywords: NOSOSCF
formula: C22H26O3
InChI: InChI=1/C22H26O3/c1-15(2)10-19-20(22(19,3)4)21(23)25-14-17-12-18(24-13-17)11-16-8-6-5-7-9-16/h5-10,12-13,19-20H,11,14H2,1-4H3
51 atoms
O  -1.877563 2.336517 0.063162
O  -1.594169 0.854449 -1.5911
O  2.062749 2.12599 1.766169
C  -4.121547 -0.54885 -0.324416
C  -2.870563 -1.165482 0.19148
C  -3.042051 0.35191 0.24916
C  -4.393301 -0.576972 -1.808231
C  -5.380399 -0.62717 0.505799
C  -2.777125 -1.938651 1.45224
C  -2.118813 1.173986 -0.545791
C  -1.628375 -2.22365 2.073857
C  -1.600847 -3.030802 3.335382
C  -0.28826 -1.759501 1.589422
C  -0.741022 3.114469 -0.358741
C  0.493775 2.55731 0.255166
C  1.314446 1.479512 -0.217203
C  1.000393 2.904909 1.460393
C  2.246648 1.255979 0.738558
C  3.346265 0.263342 0.885595
C  3.606494 -0.462158 -0.405393
C  4.581603 -0.008628 -1.288565
C  2.854215 -1.580658 -0.753026
C  4.805412 -0.662205 -2.492856
C  3.071294 -2.233564 -1.958653
C  4.048605 -1.775879 -2.832475
H  -2.180271 -1.477178 -0.587397
H  -3.268335 0.758951 1.227511
H  -4.961265 0.302121 -2.118004
H  -3.489052 -0.624559 -2.410335
H  -4.992765 -1.456297 -2.051143
H  -5.186877 -0.541785 1.574796
H  -6.066315 0.175872 0.230952
H  -5.895672 -1.574202 0.334162
H  -3.704255 -2.298113 1.888941
H  -1.016472 -3.944729 3.201622
H  -2.599934 -3.314641 3.665344
H  -1.121071 -2.474404 4.144594
H  0.166727 -1.082963 2.318672
H  -0.32685 -1.236037 0.635494
H  0.398232 -2.603508 1.485415
H  -0.938425 4.118948 0.010686
H  -0.679014 3.160949 -1.445525
H  1.216389 0.947516 -1.149432
H  0.721677 3.656701 2.182573
H  3.081962 -0.453883 1.669663
H  4.25501 0.76969 1.221269
H  5.175255 0.860244 -1.029556
H  2.0926 -1.94496 -0.073293
H  5.572872 -0.301754 -3.165636
H  2.477346 -3.101467 -2.214547
H  4.222148 -2.286414 -3.770836
elementType: O C H
totalener: -1079.73823182 hartree
nucrepener: 2176.02212089 hartree
electener: -3255.76035271 hartree
oneelecener: -5791.46190171 hartree
twoeener: 2535.70154900 hartree
cpcmener: -0.02895331 hartree
kineticenergy: 1074.85591030 hartree
xcener: -106.462119556496 hartree
chargesum: -0.0000000
charge: -0.294139 -0.506552 -0.286156 0.175820 -0.043907 -0.075339 -0.278355 -0.292845 -0.282852 0.398357 0.005764 -0.233017 -0.265341 0.077427 -0.097715 -0.300758 -0.033628 0.183900 -0.012193 -0.005520 -0.183817 -0.192065 -0.159873 -0.174783 -0.163815 0.100483 0.090905 0.100287 0.089812 0.094990 0.089931 0.099113 0.101803 0.125798 0.096641 0.090322 0.095123 0.104630 0.067772 0.105169 0.122232 0.117483 0.159494 0.179418 0.111973 0.109895 0.140886 0.168973 0.159948 0.157312 0.161007
qa: -0.2941 -0.5066 -0.2862 0.1758 -0.0439 -0.0753 -0.2784 -0.2928 -0.2829 0.3984 0.0058 -0.2330 -0.2653 0.0774 -0.0977 -0.3008 -0.0336 0.1839 -0.0122 -0.0055 -0.1838 -0.1921 -0.1599 -0.1748 -0.1638 0.1005 0.0909 0.1003 0.0898 0.0950 0.0899 0.0991 0.1018 0.1258 0.0966 0.0903 0.0951 0.1046 0.0678 0.1052 0.1222 0.1175 0.1595 0.1794 0.1120 0.1099 0.1409 0.1690 0.1599 0.1573 0.1610
va: 2.1048 1.9862 2.2615 3.7042 3.8223 3.8225 3.8793 3.9146 3.8800 4.1283 3.7491 3.9248 3.9536 3.8460 3.7099 3.9143 3.9636 3.6654 3.8119 3.6151 3.9348 3.8683 3.8887 3.9307 3.8845 1.0241 1.0357 0.9993 1.0195 1.0007 1.0011 1.0023 0.9984 1.0037 0.9965 1.0065 0.9957 0.9937 1.0106 0.9981 0.9967 1.0095 1.0149 0.9926 0.9996 1.0105 1.0032 0.9834 0.9896 0.9930 0.9889
dispcorr: -0.025814188 hartree
energy: -1079.764046009194
dipole: -15.23235 15.12999 -0.10236 -15.11673 15.06333 -0.05340 4.94217 -3.90303 1.03914
magnitude: 1.04553 au
magnitude: 2.65754 debye
