program: Orca
programVersion: 5.0.2
elementType: O O O C C C C C C C C C C C C C C C C C C C C C C H H H H H H H H H H H H H H H H H H H H H H H H H H
charge: 0
multiplicity: 1
keywords: wb97x-d3
keywords: def2-TZVPP
keywords: def2/J RIJCOSX
keywords: DEFGRID2
keywords: scfconv7
keywords: smallprint printgap noloewdin
keywords: NOSOSCF
formula: C22H26O3
InChI: InChI=1/C22H26O3/c1-15(2)10-19-20(22(19,3)4)21(23)25-14-17-12-18(24-13-17)11-16-8-6-5-7-9-16/h5-10,12-13,19-20H,11,14H2,1-4H3
51 atoms
O  -1.422724 2.111615 0.819847
O  -2.102774 1.225571 -1.118259
O  2.224446 2.108103 -1.695064
C  -4.100023 -0.226479 0.866841
C  -3.064743 -1.178552 0.3480
C  -2.624725 0.135959 0.948633
C  -5.006334 0.464617 -0.120812
C  -4.776049 -0.526868 2.181804
C  -2.727523 -2.439984 1.047714
C  -2.039199 1.18222 0.090501
C  -2.981549 -3.671632 0.595202
C  -2.585498 -4.882647 1.384551
C  -3.676035 -3.964302 -0.699208
C  -0.764667 3.188195 0.127646
C  0.575755 2.777899 -0.366595
C  1.778132 2.654386 0.404421
C  0.912459 2.428487 -1.629776
C  2.746705 2.249141 -0.448131
C  4.182005 1.915969 -0.264621
C  4.437977 0.432627 -0.384372
C  4.087373 -0.42229 0.658127
C  4.999262 -0.107665 -1.53607
C  4.299824 -1.788759 0.554435
C  5.212012 -1.476937 -1.643959
C  4.86344 -2.320937 -0.599242
H  -3.006783 -1.214791 -0.735391
H  -2.206539 0.09239 1.9488
H  -4.557737 0.586008 -1.104368
H  -5.917726 -0.122068 -0.250337
H  -5.301289 1.451492 0.241693
H  -4.098058 -0.963949 2.913939
H  -5.19079 0.384041 2.617227
H  -5.60075 -1.226969 2.033776
H  -2.235762 -2.341996 2.0114
H  -2.080766 -4.622154 2.314608
H  -1.917006 -5.525622 0.806168
H  -3.459087 -5.491031 1.632609
H  -3.941595 -3.071904 -1.262734
H  -4.596303 -4.525302 -0.517284
H  -3.054789 -4.59492 -1.340079
H  -0.67395 3.975269 0.874082
H  -1.391199 3.564148 -0.681139
H  1.899136 2.852149 1.458123
H  0.353003 2.377603 -2.550652
H  4.479237 2.268327 0.724262
H  4.790996 2.458775 -0.99191
H  3.648343 -0.012432 1.560544
H  5.279019 0.546468 -2.353324
H  4.028045 -2.439543 1.375532
H  5.652495 -1.882819 -2.545564
H  5.030217 -3.387086 -0.681323
elementType: O C H
totalener: -1079.74136493 hartree
nucrepener: 2075.10507542 hartree
electener: -3154.84644034 hartree
oneelecener: -5589.97570777 hartree
twoeener: 2435.12926743 hartree
cpcmener: -0.03116534 hartree
kineticenergy: 1074.85552551 hartree
xcener: -106.460330507621 hartree
chargesum: 0.0000000
charge: -0.290034 -0.505318 -0.286309 0.141502 0.015128 -0.136335 -0.289692 -0.263230 -0.281744 0.433137 -0.034708 -0.227122 -0.252628 0.093541 -0.086087 -0.334320 -0.016484 0.199119 -0.054519 0.043512 -0.197904 -0.196157 -0.162488 -0.158845 -0.174891 0.091668 0.090569 0.091350 0.096083 0.100808 0.089965 0.098027 0.096723 0.123836 0.090023 0.094808 0.094060 0.089959 0.096628 0.096456 0.123880 0.120455 0.163998 0.174946 0.117401 0.110639 0.145488 0.143198 0.160980 0.159469 0.161461
qa: -0.2900 -0.5053 -0.2863 0.1415 0.0151 -0.1363 -0.2897 -0.2632 -0.2817 0.4331 -0.0347 -0.2271 -0.2526 0.0935 -0.0861 -0.3343 -0.0165 0.1991 -0.0545 0.0435 -0.1979 -0.1962 -0.1625 -0.1588 -0.1749 0.0917 0.0906 0.0914 0.0961 0.1008 0.0900 0.0980 0.0967 0.1238 0.0900 0.0948 0.0941 0.0900 0.0966 0.0965 0.1239 0.1205 0.1640 0.1749 0.1174 0.1106 0.1455 0.1432 0.1610 0.1595 0.1615
va: 2.1214 1.9947 2.2695 3.6714 3.7624 3.8989 3.9038 3.9056 3.8734 4.1468 3.7195 3.9238 3.9443 3.8009 3.6183 4.0112 3.9453 3.6272 3.8139 3.5841 3.9350 3.9477 3.8997 3.8891 3.8916 1.0312 1.0385 1.0183 1.0009 0.9991 1.0033 1.0027 1.0028 1.0073 1.0080 0.9956 0.9961 1.0080 0.9972 0.9977 0.9942 1.0115 1.0064 1.0013 1.0068 1.0082 1.0026 1.0041 0.9900 0.9902 0.9892
dispcorr: -0.021950859 hartree
energy: -1079.763315787209
dipole: -22.59696 22.54007 -0.05689 -19.42999 19.43734 0.00735 7.44871 -6.22976 1.21895
magnitude: 1.22030 au
magnitude: 3.10175 debye
