program: Gaussian 09
title: 000072854
version: EM64L-G09RevD.01
frameworkgroup: C1[X(C12H14O2)]
method: RPBEPBE
basis: SDD
operation: Freq
keyword: #pfreq=noraman
keyword: PBEPBE/SDD
title: #p freq=noraman PBEPBE/SDD
converged: YES YES NO NO
title: Mulliken charges:
elementType: O O C C C C C C C C C C C C H H H H H H H H H H H H H H
charge: -0.434439 -0.258592 -0.238005 0.552933 -0.689798 -0.689353 -0.401389 -0.469058 0.492433 -0.393453 -0.389030 -0.260101 -0.318518 0.150636 0.211395 0.211421 0.215799 0.229244 0.229178 0.215808 0.211661 0.233114 0.237403 0.228883 0.235292 0.261691 0.248711 0.376133
chargesum: 0.00000
title: Mulliken charges with hydrogens summed into heavy atoms:
elementType: O O C C C C C C C C C C C C
charge: -0.058306 -0.258592 -0.026610 0.552933 -0.033335 -0.032705 -0.168275 -0.231655 0.492433 -0.164570 -0.153738 0.001590 -0.069807 0.150636
polarizability: 2.69598705e+02 7.85269721e+00 1.29376554e+02 -4.66596653e-02 -9.99787098e-02 7.46461434e+01
1716.lowfreq: -1.9599 0.0005 0.0007 0.0008 3.2077 5.6618 32.1694 41.4986 60.8252
frequency: 32.1391 41.4660 60.8067 76.6934 123.3938 165.6074 172.6614 209.5355 227.3756 246.6425 261.8699 275.5345 341.4163 396.5018 416.3771 457.3007 508.0163 532.3302 539.7005 588.9719 597.5523 636.9326 688.0758 722.1226 756.7128 834.8810 842.9171 843.8310 889.1798 889.3279 917.6255 938.9993 955.2337 964.8835 978.5147 1009.8324 1013.4006 1044.7956 1056.8234 1110.0666 1113.8741 1156.4592 1193.2576 1217.1283 1228.9698 1237.5453 1291.9899 1302.5012 1305.2417 1335.1507 1346.5620 1378.3612 1390.3790 1397.7617 1420.8049 1465.9994 1468.0137 1479.7458 1483.9515 1507.8081 1568.4566 1612.7105 1632.2438 1648.9472 2976.3866 2978.8946 2982.6184 3069.8599 3076.7278 3079.3401 3083.4911 3098.5575 3117.8798 3124.0681 3140.5132 3150.8063 3165.8816 3526.7977
redmass: 3.4926 4.3412 4.7862 5.4038 3.7938 2.6849 4.3107 1.1022 1.6425 1.9683 2.9652 3.4829 3.1855 3.1066 2.9549 3.3145 4.5640 3.3908 2.1772 1.2922 4.1888 6.9020 3.6316 3.6460 3.6317 5.4397 1.3953 1.4677 1.8647 2.5846 1.1773 5.0602 1.4579 1.3681 1.3817 2.9571 1.2066 1.8085 1.7812 2.5835 1.5883 1.7383 1.1488 1.4495 1.7278 1.8557 1.6276 1.9281 1.3228 1.8571 1.5965 1.1907 3.1255 1.2726 2.8918 1.0453 1.0503 1.0486 1.0996 2.4072 6.1479 6.5099 7.6622 5.7350 1.0348 1.0353 1.0843 1.1000 1.0991 1.1006 1.0998 1.0900 1.0873 1.0870 1.0964 1.0962 1.0916 1.0640
irintensity: 0.3152 0.3416 0.3675 0.1815 0.0265 1.7495 0.3242 0.0153 0.3345 0.3729 0.0165 1.6836 3.1077 0.0504 0.2189 14.0392 3.9416 39.1278 0.8376 168.0812 13.1664 0.0385 24.6541 3.1441 3.7253 15.4760 31.1674 34.1690 2.6019 2.9988 2.8502 10.0862 0.0980 3.4146 0.2236 3.6657 43.6820 470.0548 157.8348 0.9900 14.8637 0.5757 14.1607 15.7406 1.2051 8.5657 9.0705 16.5643 0.6369 26.8618 49.4561 15.2896 19.0748 9.4028 14.1032 0.4850 5.8900 17.9528 4.8518 33.8155 9.3494 355.7523 273.5729 127.1341 30.4322 38.9730 20.0128 0.3753 105.3853 23.9272 39.2489 2.2853 11.1228 15.6891 28.8351 5.4669 9.3590 54.3001
temp: 298.150 k
press: 1.00000 atm
elementType: 8 8 6 6 6 6 6 6 6 6 6 6 6 6 1 1 1 1 1 1 1 1 1 1 1 1 1 1
symmnumber: 1
zpe: 598861.0 jmol-1
zpe.correction: 0.228094 hartree
zpe.thermalcorrener: 0.242188 hartree
zpe.thermalcorrenthalpy: 0.243132 hartree
zpe.thermalcorrgfe: 0.185999 hartree
zpe.sumelectzpe: -615.099126 hartree
zpe.sumelectthermal: -615.085032 hartree
zpe.sumelectthermalent: -615.084088 hartree
zpe.sumelectthermalfe: -615.141221 hartree
dipole: 3.6256 -0.9366 0.0038
dipole: 3.7446
quadrupole: -79.7174 -80.5956 -87.3135
quadrupole: 7.4969 -0.0205 0.0006
quadrupole: 2.8248 1.9466 -4.7714 7.4969 -0.0205 0.0006
hfenergy: -615.3272198 hartree
pointgroup: C01 [X(C12H14O2)]
dipole: 1.4248363 0.3716976 0.0462581 debye
polarizability: 269.6624474|-7.1569434|128.3607744|-1.2348054|7.1502863|75.5981809 unknown
InChI: InChI=1S/C12H14O2/c1-9(2)11-6-3-10(4-7-11)5-8-12(13)14/h3-9,13H,1-2H3
charge 0 multiplicity 1
28 atoms
O  -5.068513 1.3366 0.161608
O  -4.81997 -0.960323 -0.137467
C  3.940042 -0.08792 -0.036201
C  2.413488 -0.178918 -0.04449
C  4.471416 0.454021 1.318566
C  4.465279 0.771532 -1.218165
C  1.605059 0.982817 0.112538
C  1.758035 -1.424853 -0.210343
C  -0.45747 -0.350416 -0.063025
C  0.202905 0.903316 0.104212
C  0.351286 -1.511271 -0.219689
C  -1.915601 -0.498111 -0.080756
C  -2.853001 0.492793 0.048224
C  -4.28787 0.170532 0.008655
H  4.336886 -1.114871 -0.166357
H  4.118987 1.486403 1.500111
H  5.576944 0.470139 1.320294
H  4.131942 -0.172948 2.162382
H  4.116564 0.374826 -2.188416
H  5.570904 0.783122 -1.224741
H  4.11776 1.818108 -1.135362
H  2.084184 1.960295 0.243254
H  2.357905 -2.334711 -0.33282
H  -0.386998 1.818109 0.228601
H  -0.134699 -2.486127 -0.349811
H  -2.302959 -1.519693 -0.212202
H  -2.596457 1.54745 0.183615
H  -6.02935 1.0795 0.130286
