program: Orca
programVersion: 5.0.2
elementType: O O O C C C C C C C C C C C C C C C C C C C C C C H H H H H H H H H H H H H H H H H H H H H H H H H H
charge: 0
multiplicity: 1
keywords: wb97x-d3
keywords: def2-TZVPP
keywords: def2/J RIJCOSX
keywords: DEFGRID2
keywords: scfconv7
keywords: smallprint printgap noloewdin
keywords: NOSOSCF
formula: C22H26O3
InChI: InChI=1/C22H26O3/c1-15(2)10-19-20(22(19,3)4)21(23)25-14-17-12-18(24-13-17)11-16-8-6-5-7-9-16/h5-10,12-13,19-20H,11,14H2,1-4H3
51 atoms
O  -1.315691 1.407631 1.178577
O  -2.177721 1.719752 -0.860166
O  2.101551 2.51799 -1.341787
C  -1.615536 -1.585861 0.23222
C  -2.439975 -1.237074 1.426589
C  -2.521182 -0.361883 0.192083
C  -0.116579 -1.415345 0.306155
C  -2.036652 -2.727365 -0.660167
C  -3.628053 -2.023602 1.847409
C  -1.994734 1.011921 0.107849
C  -4.604618 -1.548054 2.625036
C  -5.756511 -2.405092 3.051212
C  -4.625221 -0.14271 3.144383
C  -0.614411 2.664172 1.110409
C  0.640411 2.515669 0.329606
C  1.845094 1.870188 0.760525
C  0.859125 2.884165 -0.953701
C  2.69687 1.895526 -0.289253
C  4.046443 1.317146 -0.507295
C  3.971599 0.062575 -1.346855
C  3.411925 -1.096429 -0.813042
C  4.420644 0.047093 -2.662089
C  3.30471 -2.247943 -1.577859
C  4.315152 -1.106151 -3.431838
C  3.756582 -2.255653 -2.892582
H  -1.873782 -0.801773 2.244785
H  -3.403959 -0.490259 -0.42451
H  0.195549 -0.693848 1.058434
H  0.348971 -2.36917 0.562492
H  0.292268 -1.100831 -0.65607
H  -3.118612 -2.798105 -0.769465
H  -1.612785 -2.604287 -1.658416
H  -1.676654 -3.679106 -0.264594
H  -3.684864 -3.056855 1.51729
H  -6.70392 -1.989072 2.6991
H  -5.828009 -2.452255 4.140906
H  -5.673474 -3.424278 2.674426
H  -4.425028 -0.125548 4.219566
H  -5.6124 0.305626 3.008958
H  -3.894179 0.505073 2.662285
H  -0.402088 2.91219 2.148605
H  -1.257393 3.443761 0.701965
H  2.042399 1.437415 1.729103
H  0.256216 3.402814 -1.682539
H  4.473972 1.088634 0.470443
H  4.705893 2.048035 -0.981165
H  3.05448 -1.096097 0.210758
H  4.858565 0.941363 -3.089528
H  2.868311 -3.140267 -1.147369
H  4.669337 -1.103528 -4.454692
H  3.67354 -3.15332 -3.491447
elementType: O C H
totalener: -1079.73784902 hartree
nucrepener: 2157.10286453 hartree
electener: -3236.84071355 hartree
oneelecener: -5753.44771632 hartree
twoeener: 2516.60700277 hartree
cpcmener: -0.03141363 hartree
kineticenergy: 1074.86035332 hartree
xcener: -106.462622681411 hartree
chargesum: 0.0000000
charge: -0.279968 -0.500814 -0.285565 0.193382 -0.011182 -0.117083 -0.326123 -0.302794 -0.308054 0.421000 -0.011229 -0.227590 -0.253473 0.072111 -0.050639 -0.398509 -0.020768 0.237772 -0.052750 0.057307 -0.238904 -0.194799 -0.155904 -0.156421 -0.172789 0.106357 0.093417 0.098569 0.105959 0.110387 0.092503 0.099070 0.100257 0.126073 0.095597 0.094737 0.089261 0.104417 0.094205 0.080808 0.120393 0.121047 0.166434 0.176524 0.118241 0.108869 0.156955 0.142468 0.160071 0.160001 0.161167
qa: -0.2800 -0.5008 -0.2856 0.1934 -0.0112 -0.1171 -0.3261 -0.3028 -0.3081 0.4210 -0.0112 -0.2276 -0.2535 0.0721 -0.0506 -0.3985 -0.0208 0.2378 -0.0527 0.0573 -0.2389 -0.1948 -0.1559 -0.1564 -0.1728 0.1064 0.0934 0.0986 0.1060 0.1104 0.0925 0.0991 0.1003 0.1261 0.0956 0.0947 0.0893 0.1044 0.0942 0.0808 0.1204 0.1210 0.1664 0.1765 0.1182 0.1089 0.1570 0.1425 0.1601 0.1600 0.1612
va: 2.0979 1.9922 2.2651 3.7013 3.7979 3.8335 3.8901 3.9071 3.8727 4.1276 3.7046 3.9286 3.9422 3.8313 3.6053 3.9811 3.9662 3.5770 3.8166 3.5746 3.9154 3.9522 3.8824 3.8868 3.8998 1.0195 1.0301 1.0062 0.9999 0.9897 1.0014 1.0022 0.9989 1.0031 0.9964 0.9951 1.0067 0.9972 0.9999 1.0172 0.9953 1.0091 1.0063 1.0005 1.0064 1.0110 0.9919 1.0034 0.9913 0.9897 0.9890
dispcorr: -0.026072169 hartree
energy: -1079.763921194103
dipole: -16.62911 17.14995 0.52084 -16.90617 16.21929 -0.68688 11.05897 -9.60274 1.45624
magnitude: 1.69225 au
magnitude: 4.30136 debye
