program: Orca
programVersion: 5.0.2
elementType: O O O C C C C C C C C C C C C C C C C C C C C C C H H H H H H H H H H H H H H H H H H H H H H H H H H
charge: 0
multiplicity: 1
keywords: wb97x-d3
keywords: def2-TZVPP
keywords: def2/J RIJCOSX
keywords: DEFGRID2
keywords: scfconv7
keywords: smallprint printgap noloewdin
keywords: NOSOSCF
formula: C22H26O3
InChI: InChI=1/C22H26O3/c1-15(2)10-19-20(22(19,3)4)21(23)25-14-17-12-18(24-13-17)11-16-8-6-5-7-9-16/h5-10,12-13,19-20H,11,14H2,1-4H3
51 atoms
O  -1.45012 2.011289 0.966343
O  -0.552242 0.100138 1.70751
O  1.648309 1.67819 -1.846048
C  -2.992346 -1.049951 0.027414
C  -3.268546 -1.175203 1.495628
C  -2.824571 0.155606 0.940689
C  -1.787881 -1.761771 -0.535797
C  -4.152441 -0.978493 -0.933538
C  -4.641878 -1.301775 2.040942
C  -1.496268 0.706789 1.256193
C  -5.176265 -2.430138 2.515552
C  -6.559496 -2.451826 3.091304
C  -4.457697 -3.745083 2.535678
C  -0.213437 2.695967 1.148626
C  0.754323 2.377221 0.062511
C  2.158223 2.654981 0.073755
C  0.501688 1.788334 -1.128516
C  2.650128 2.210951 -1.106861
C  4.02194 2.156708 -1.669553
C  4.540116 0.741733 -1.781688
C  4.670992 -0.049858 -0.642131
C  4.895659 0.206351 -3.014239
C  5.15162 -1.347167 -0.733753
C  5.379685 -1.093437 -3.109524
C  5.509197 -1.873407 -1.969918
H  -2.499419 -1.715328 2.039849
H  -3.599534 0.906792 0.830856
H  -2.087378 -2.746148 -0.90133
H  -1.360925 -1.214936 -1.379216
H  -1.000641 -1.917345 0.198786
H  -3.841035 -0.524749 -1.876153
H  -4.527656 -1.979403 -1.156001
H  -4.983415 -0.392362 -0.542815
H  -5.246898 -0.399701 2.056196
H  -6.54426 -2.792075 4.130094
H  -7.200769 -3.150792 2.548613
H  -7.030989 -1.469591 3.066601
H  -3.537604 -3.743922 1.953329
H  -5.099325 -4.536412 2.141176
H  -4.205841 -4.036014 3.559232
H  0.215233 2.478914 2.129229
H  -0.473849 3.754597 1.138176
H  2.724434 3.117296 0.867227
H  -0.394543 1.405533 -1.591467
H  4.6710 2.741658 -1.014977
H  4.049802 2.638173 -2.650411
H  4.394394 0.353175 0.325525
H  4.79578 0.810404 -3.908177
H  5.248858 -1.949044 0.16063
H  5.653178 -1.495366 -4.076593
H  5.884406 -2.885909 -2.041915
elementType: O C H
totalener: -1079.73969072 hartree
nucrepener: 2069.32022610 hartree
electener: -3149.05991682 hartree
oneelecener: -5578.27644550 hartree
twoeener: 2429.21652868 hartree
cpcmener: -0.03302312 hartree
kineticenergy: 1074.85828978 hartree
xcener: -106.463311736428 hartree
chargesum: -0.0000000
charge: -0.294315 -0.489979 -0.292227 0.155021 -0.001438 -0.125577 -0.296000 -0.267108 -0.279351 0.396858 -0.027758 -0.228248 -0.256953 0.110696 -0.029089 -0.354828 -0.062984 0.212981 -0.046641 0.011666 -0.189859 -0.184128 -0.163779 -0.157411 -0.173438 0.098501 0.092646 0.100455 0.097530 0.093924 0.098855 0.096609 0.091586 0.123671 0.094487 0.094854 0.089316 0.089974 0.094745 0.102212 0.117408 0.122896 0.164440 0.176477 0.115944 0.105950 0.147385 0.142817 0.160502 0.159819 0.160889
qa: -0.2943 -0.4900 -0.2922 0.1550 -0.0014 -0.1256 -0.2960 -0.2671 -0.2794 0.3969 -0.0278 -0.2282 -0.2570 0.1107 -0.0291 -0.3548 -0.0630 0.2130 -0.0466 0.0117 -0.1899 -0.1841 -0.1638 -0.1574 -0.1734 0.0985 0.0926 0.1005 0.0975 0.0939 0.0989 0.0966 0.0916 0.1237 0.0945 0.0949 0.0893 0.0900 0.0947 0.1022 0.1174 0.1229 0.1644 0.1765 0.1159 0.1059 0.1474 0.1428 0.1605 0.1598 0.1609
va: 2.1175 2.0015 2.2579 3.6566 3.7898 3.8761 3.8974 3.9030 3.8774 4.1747 3.6967 3.9270 3.9430 3.8096 3.6090 4.0002 3.9495 3.6096 3.8196 3.6371 3.9238 3.9357 3.9030 3.8875 3.8924 1.0239 1.0392 1.0022 1.0025 1.0167 1.0028 1.0029 1.0026 1.0070 0.9943 0.9967 1.0080 1.0057 0.9987 0.9964 1.0102 0.9915 1.0047 0.9954 1.0053 1.0092 1.0032 1.0029 0.9908 0.9902 0.9895
dispcorr: -0.022890906 hartree
energy: -1079.762581624767
dipole: -24.40315 23.74041 -0.66274 -17.45101 17.93750 0.48649 5.50036 -5.69782 -0.19746
magnitude: 0.84551 au
magnitude: 2.14912 debye
