program: Orca
programVersion: 5.0.2
elementType: O O O C C C C C C C C C C C C C C C C C C C C C C H H H H H H H H H H H H H H H H H H H H H H H H H H
charge: 0
multiplicity: 1
keywords: wb97x-d3
keywords: def2-TZVPP
keywords: def2/J RIJCOSX
keywords: DEFGRID2
keywords: scfconv7
keywords: smallprint printgap noloewdin
keywords: NOSOSCF
formula: C22H26O3
InChI: InChI=1/C22H26O3/c1-15(2)10-19-20(22(19,3)4)21(23)25-14-17-12-18(24-13-17)11-16-8-6-5-7-9-16/h5-10,12-13,19-20H,11,14H2,1-4H3
51 atoms
O  -1.315577 1.444439 1.220391
O  -2.178659 1.678053 -0.827962
O  2.069994 2.514078 -1.351283
C  -1.51543 -1.575757 0.327017
C  -2.348258 -1.237692 1.519856
C  -2.465587 -0.385652 0.276841
C  -0.023453 -1.348472 0.384566
C  -1.901582 -2.749567 -0.538834
C  -3.501626 -2.077954 1.939215
C  -1.981574 1.001696 0.159461
C  -4.651108 -1.607325 2.429842
C  -5.762918 -2.525579 2.835289
C  -4.935067 -0.148322 2.612516
C  -0.632459 2.708109 1.111352
C  0.621389 2.551372 0.330228
C  1.835321 1.930839 0.7723
C  0.827157 2.880143 -0.965945
C  2.678108 1.929143 -0.285156
C  4.029972 1.353577 -0.498405
C  3.953532 0.072746 -1.296567
C  3.492035 -1.095387 -0.693683
C  4.298022 0.042152 -2.643069
C  3.381505 -2.271246 -1.420399
C  4.186766 -1.134392 -3.374914
C  3.728673 -2.293835 -2.76608
H  -1.79482 -0.779985 2.335801
H  -3.347623 -0.552228 -0.331933
H  0.268701 -0.610953 1.129403
H  0.480856 -2.282585 0.641486
H  0.363978 -1.02462 -0.583786
H  -2.981574 -2.871983 -0.621595
H  -1.504656 -2.625762 -1.548125
H  -1.489487 -3.676674 -0.135093
H  -3.378743 -3.154089 1.851804
H  -6.676031 -2.300172 2.278363
H  -6.009327 -2.401024 3.892683
H  -5.514402 -3.573102 2.666843
H  -4.08545 0.490684 2.379039
H  -5.233493 0.056136 3.643747
H  -5.773749 0.163765 1.984471
H  -0.420832 2.991999 2.140391
H  -1.286843 3.465459 0.679954
H  2.043015 1.530155 1.752334
H  0.21353 3.369696 -1.705837
H  4.469626 1.15888 0.480857
H  4.677727 2.073644 -1.003466
H  3.214213 -1.082772 0.35435
H  4.659697 0.942935 -3.124531
H  3.023308 -3.1708 -0.936315
H  4.460193 -1.143715 -4.422168
H  3.643488 -3.210524 -3.334937
elementType: O C H
totalener: -1079.73765136 hartree
nucrepener: 2164.25545922 hartree
electener: -3243.99311058 hartree
oneelecener: -5767.81114408 hartree
twoeener: 2523.81803350 hartree
cpcmener: -0.03114698 hartree
kineticenergy: 1074.86433293 hartree
xcener: -106.463465736083 hartree
chargesum: 0.0000000
charge: -0.281789 -0.499285 -0.285111 0.190122 0.022077 -0.144272 -0.336572 -0.295137 -0.324090 0.424535 -0.013776 -0.230209 -0.238666 0.070240 -0.047619 -0.402257 -0.019742 0.235117 -0.049464 0.074411 -0.253612 -0.200619 -0.149202 -0.155626 -0.174544 0.107448 0.097317 0.100317 0.104290 0.110892 0.094130 0.098424 0.098559 0.124042 0.094718 0.096518 0.090271 0.078069 0.101155 0.099742 0.120906 0.120905 0.165649 0.176250 0.117167 0.110261 0.152855 0.143197 0.160938 0.159825 0.161246
qa: -0.2818 -0.4993 -0.2851 0.1901 0.0221 -0.1443 -0.3366 -0.2951 -0.3241 0.4245 -0.0138 -0.2302 -0.2387 0.0702 -0.0476 -0.4023 -0.0197 0.2351 -0.0495 0.0744 -0.2536 -0.2006 -0.1492 -0.1556 -0.1745 0.1074 0.0973 0.1003 0.1043 0.1109 0.0941 0.0984 0.0986 0.1240 0.0947 0.0965 0.0903 0.0781 0.1012 0.0997 0.1209 0.1209 0.1656 0.1763 0.1172 0.1103 0.1529 0.1432 0.1609 0.1598 0.1612
va: 2.0957 1.9932 2.2649 3.6836 3.7745 3.8492 3.9025 3.9014 3.8877 4.1168 3.7058 3.9300 3.9304 3.8338 3.5990 3.9832 3.9654 3.5798 3.8126 3.5485 3.9205 3.9580 3.8689 3.8866 3.9012 1.0199 1.0275 1.0058 1.0006 0.9879 1.0021 1.0026 1.0001 1.0027 0.9966 0.9961 1.0060 1.0196 0.9998 0.9985 0.9951 1.0091 1.0066 1.0006 1.0073 1.0105 0.9955 1.0038 0.9906 0.9897 0.9889
dispcorr: -0.026471764 hartree
energy: -1079.764123126882
dipole: -16.80800 17.28968 0.48168 -17.00608 16.36418 -0.64190 9.96191 -8.57347 1.38844
magnitude: 1.60369 au
magnitude: 4.07626 debye
