program: Orca
programVersion: 5.0.2
elementType: O O O C C C C C C C C C C C C C C C C C C C C C C H H H H H H H H H H H H H H H H H H H H H H H H H H
charge: 0
multiplicity: 1
keywords: wb97x-d3
keywords: def2-TZVPP
keywords: def2/J RIJCOSX
keywords: DEFGRID2
keywords: scfconv7
keywords: smallprint printgap noloewdin
keywords: NOSOSCF
formula: C22H26O3
InChI: InChI=1/C22H26O3/c1-15(2)10-19-20(22(19,3)4)21(23)25-14-17-12-18(24-13-17)11-16-8-6-5-7-9-16/h5-10,12-13,19-20H,11,14H2,1-4H3
51 atoms
O  -1.516352 2.092267 0.886558
O  -0.586813 0.252945 1.752209
O  1.66308 1.71204 -1.844361
C  -2.923013 -1.06991 0.078232
C  -3.20696 -1.13889 1.547008
C  -2.835223 0.187661 0.933722
C  -1.673314 -1.721683 -0.459341
C  -4.081127 -1.124028 -0.886487
C  -4.578226 -1.323783 2.085396
C  -1.535814 0.805621 1.244614
C  -5.089206 -2.491697 2.483589
C  -6.472039 -2.580784 3.052402
C  -4.344859 -3.788626 2.404756
C  -0.295835 2.811135 1.061216
C  0.707496 2.448945 0.021672
C  2.118547 2.679012 0.094644
C  0.489234 1.861944 -1.176801
C  2.648579 2.215406 -1.061147
C  4.042142 2.12431 -1.561535
C  4.511939 0.697208 -1.723771
C  4.429781 -0.198362 -0.658975
C  5.041403 0.254435 -2.930719
C  4.86457 -1.507382 -0.800081
C  5.480525 -1.056575 -3.074971
C  5.390619 -1.94211 -2.01108
H  -2.414223 -1.601285 2.128557
H  -3.645585 0.891973 0.778696
H  -1.909772 -2.729657 -0.805139
H  -1.277393 -1.167249 -1.313306
H  -0.87987 -1.812255 0.279747
H  -4.372018 -2.16136 -1.069015
H  -4.959976 -0.594557 -0.518392
H  -3.804128 -0.684162 -1.84653
H  -5.198715 -0.435672 2.164337
H  -7.093079 -3.267219 2.471523
H  -6.969469 -1.611404 3.075623
H  -6.450771 -2.973429 4.072373
H  -4.918878 -4.523804 1.835299
H  -4.201492 -4.216734 3.400356
H  -3.366629 -3.696244 1.935287
H  0.110919 2.658087 2.062961
H  -0.57568 3.862375 0.984316
H  2.664784 3.123977 0.911722
H  -0.396104 1.504266 -1.679049
H  4.681593 2.649639 -0.848794
H  4.140713 2.652018 -2.513785
H  4.019007 0.12982 0.28907
H  5.111219 0.939575 -3.767379
H  4.791757 -2.190748 0.036193
H  5.889594 -1.384907 -4.021776
H  5.726608 -2.964783 -2.122491
elementType: O C H
totalener: -1079.73951695 hartree
nucrepener: 2074.76364558 hartree
electener: -3154.50316253 hartree
oneelecener: -5589.18259730 hartree
twoeener: 2434.67943477 hartree
cpcmener: -0.03247352 hartree
kineticenergy: 1074.85133770 hartree
xcener: -106.461965340271 hartree
chargesum: 0.0000000
charge: -0.294866 -0.492058 -0.292777 0.146035 -0.012496 -0.109727 -0.298905 -0.273323 -0.265121 0.396501 -0.036587 -0.229894 -0.250429 0.115303 -0.028572 -0.352793 -0.065075 0.209092 -0.040209 0.005136 -0.188491 -0.183424 -0.163643 -0.156544 -0.173137 0.098563 0.094556 0.100477 0.098959 0.094906 0.097223 0.092869 0.099873 0.123055 0.094394 0.089776 0.095066 0.096516 0.101233 0.087556 0.117146 0.122028 0.163673 0.177325 0.113869 0.105318 0.147023 0.143350 0.160714 0.159663 0.160877
qa: -0.2949 -0.4921 -0.2928 0.1460 -0.0125 -0.1097 -0.2989 -0.2733 -0.2651 0.3965 -0.0366 -0.2299 -0.2504 0.1153 -0.0286 -0.3528 -0.0651 0.2091 -0.0402 0.0051 -0.1885 -0.1834 -0.1636 -0.1565 -0.1731 0.0986 0.0946 0.1005 0.0990 0.0949 0.0972 0.0929 0.0999 0.1231 0.0944 0.0898 0.0951 0.0965 0.1012 0.0876 0.1171 0.1220 0.1637 0.1773 0.1139 0.1053 0.1470 0.1433 0.1607 0.1597 0.1609
va: 2.1204 1.9988 2.2567 3.6609 3.8017 3.8631 3.8943 3.9048 3.8620 4.1831 3.7011 3.9271 3.9393 3.8047 3.6058 3.9963 3.9468 3.6144 3.8217 3.6521 3.9191 3.9329 3.8979 3.8896 3.8938 1.0257 1.0364 1.0023 1.0022 1.0163 1.0015 1.0019 1.0030 1.0065 0.9964 1.0075 0.9950 0.9977 0.9980 1.0076 1.0112 0.9915 1.0050 0.9955 1.0048 1.0084 1.0041 1.0024 0.9908 0.9902 0.9896
dispcorr: -0.023117784 hartree
energy: -1079.762634737803
dipole: -23.72273 23.06508 -0.65765 -18.24592 18.65363 0.40771 5.37762 -5.63021 -0.25259
magnitude: 0.81396 au
magnitude: 2.06893 debye
