program: Orca
programVersion: 5.0.2
elementType: O O O C C C C C C C C C C C C C C C C C C C C C C H H H H H H H H H H H H H H H H H H H H H H H H H H
charge: 0
multiplicity: 1
keywords: wb97x-d3
keywords: def2-TZVPP
keywords: def2/J RIJCOSX
keywords: DEFGRID2
keywords: scfconv7
keywords: smallprint printgap noloewdin
keywords: NOSOSCF
formula: C22H26O3
InChI: InChI=1/C22H26O3/c1-15(2)10-19-20(22(19,3)4)21(23)25-14-17-12-18(24-13-17)11-16-8-6-5-7-9-16/h5-10,12-13,19-20H,11,14H2,1-4H3
51 atoms
O  -1.386681 1.461338 1.082675
O  -2.139174 1.82749 -0.990797
O  2.192682 2.507591 -1.208293
C  -1.626176 -1.500447 0.020277
C  -2.503003 -1.19902 1.191478
C  -2.537459 -0.281902 -0.015304
C  -0.13325 -1.324274 0.17209
C  -1.993755 -2.609466 -0.934403
C  -3.698656 -2.008082 1.536783
C  -2.009226 1.094124 -0.033902
C  -4.631645 -1.638125 2.418126
C  -5.791416 -2.527504 2.746482
C  -4.604308 -0.329762 3.146954
C  -0.66492 2.708209 1.072325
C  0.63496 2.54265 0.372144
C  1.800895 1.881163 0.878917
C  0.93601 2.897247 -0.898544
C  2.713277 1.88379 -0.119385
C  4.060668 1.275309 -0.257265
C  3.996015 0.008492 -1.078435
C  4.406621 -0.009753 -2.406515
C  3.473949 -1.155679 -0.518994
C  4.300623 -1.171057 -3.163218
C  3.367614 -2.316136 -1.270899
C  3.781201 -2.326655 -2.597787
H  -1.972865 -0.790035 2.045752
H  -3.391431 -0.390746 -0.674919
H  0.319134 -0.96989 -0.756112
H  0.136427 -0.631423 0.966144
H  0.325771 -2.284822 0.413536
H  -1.515565 -2.447259 -1.902062
H  -1.651795 -3.574813 -0.55613
H  -3.067171 -2.678747 -1.108741
H  -3.804529 -2.972637 1.049371
H  -5.826962 -2.746942 3.816697
H  -5.748513 -3.474976 2.209876
H  -6.738911 -2.040809 2.501063
H  -5.57507 0.167672 3.077788
H  -3.850207 0.359366 2.768875
H  -4.413455 -0.482869 4.213017
H  -0.516637 2.946498 2.123859
H  -1.26791 3.500303 0.628974
H  1.930082 1.453173 1.860865
H  0.384305 3.419163 -1.664601
H  4.433683 1.055689 0.744184
H  4.757613 1.983957 -0.710821
H  4.814459 0.88915 -2.85348
H  3.14459 -1.151281 0.514074
H  4.624498 -1.170922 -4.196043
H  2.962169 -3.21346 -0.821045
H  3.699687 -3.231456 -3.185999
elementType: O C H
totalener: -1079.73794076 hartree
nucrepener: 2161.74663724 hartree
electener: -3241.48457799 hartree
oneelecener: -5762.75141237 hartree
twoeener: 2521.26683438 hartree
cpcmener: -0.03131342 hartree
kineticenergy: 1074.86313490 hartree
xcener: -106.463376473100 hartree
chargesum: 0.0000000
charge: -0.281141 -0.499399 -0.285113 0.194922 -0.024421 -0.103910 -0.323088 -0.305873 -0.295937 0.416971 -0.014179 -0.230747 -0.254596 0.072921 -0.051684 -0.399046 -0.018802 0.234892 -0.048344 0.077608 -0.203406 -0.251387 -0.154111 -0.150812 -0.174544 0.105761 0.094166 0.109120 0.099846 0.103952 0.099913 0.101506 0.091087 0.126968 0.094493 0.088860 0.095731 0.094531 0.080654 0.102547 0.120178 0.120846 0.165054 0.175907 0.116833 0.110327 0.142598 0.150072 0.160031 0.161016 0.161230
qa: -0.2811 -0.4994 -0.2851 0.1949 -0.0244 -0.1039 -0.3231 -0.3059 -0.2959 0.4170 -0.0142 -0.2307 -0.2546 0.0729 -0.0517 -0.3990 -0.0188 0.2349 -0.0483 0.0776 -0.2034 -0.2514 -0.1541 -0.1508 -0.1745 0.1058 0.0942 0.1091 0.0998 0.1040 0.0999 0.1015 0.0911 0.1270 0.0945 0.0889 0.0957 0.0945 0.0807 0.1025 0.1202 0.1208 0.1651 0.1759 0.1168 0.1103 0.1426 0.1501 0.1600 0.1610 0.1612
va: 2.0988 1.9930 2.2651 3.7146 3.7993 3.8368 3.8860 3.9103 3.8732 4.1355 3.7073 3.9297 3.9438 3.8300 3.6077 3.9831 3.9612 3.5806 3.8122 3.5457 3.9614 3.9169 3.8864 3.8647 3.9017 1.0172 1.0301 0.9891 1.0056 1.0005 1.0017 0.9987 1.0016 1.0036 0.9951 1.0072 0.9961 0.9991 1.0171 0.9970 0.9951 1.0100 1.0070 1.0007 1.0076 1.0107 1.0043 0.9977 0.9896 0.9904 0.9888
dispcorr: -0.026153167 hartree
energy: -1079.764093923695
dipole: -16.73395 17.20112 0.46717 -17.30497 16.56009 -0.74488 10.13709 -8.68463 1.45246
magnitude: 1.69786 au
magnitude: 4.31562 debye
