program: Orca
programVersion: 5.0.2
elementType: O O O C C C C C C C C C C C C C C C C C C C C C C H H H H H H H H H H H H H H H H H H H H H H H H H H
charge: 0
multiplicity: 1
keywords: wb97x-d3
keywords: def2-TZVPP
keywords: def2/J RIJCOSX
keywords: DEFGRID2
keywords: scfconv7
keywords: smallprint printgap noloewdin
keywords: NOSOSCF
formula: C22H26O3
InChI: InChI=1/C22H26O3/c1-15(2)10-19-20(22(19,3)4)21(23)25-14-17-12-18(24-13-17)11-16-8-6-5-7-9-16/h5-10,12-13,19-20H,11,14H2,1-4H3
51 atoms
O  -1.908911 2.246261 0.79883
O  -1.954859 1.715134 -1.374193
O  2.312833 2.03386 1.033543
C  -3.569997 -0.813907 -0.496834
C  -2.119639 -1.136454 -0.381824
C  -2.66536 0.127449 0.274123
C  -4.141941 -0.435465 -1.840817
C  -4.548707 -1.578023 0.363542
C  -1.610251 -2.250275 0.458595
C  -2.166406 1.420098 -0.218251
C  -0.579757 -2.171534 1.305202
C  -0.142463 -3.356965 2.109247
C  0.209855 -0.917847 1.533972
C  -1.049062 3.378275 0.554507
C  0.356358 2.9031 0.440022
C  1.054581 2.474618 -0.735904
C  1.175733 2.613303 1.478171
C  2.230062 1.949752 -0.320303
C  3.307811 1.214769 -1.030042
C  3.101723 -0.278234 -0.903317
C  2.067028 -0.898778 -1.601637
C  3.895108 -1.046243 -0.059255
C  1.833349 -2.258077 -1.462813
C  3.664039 -2.410251 0.082193
C  2.632972 -3.0199 -0.61784
H  -1.544225 -0.94126 -1.285511
H  -2.767882 0.075605 1.351736
H  -4.538347 -1.328715 -2.32741
H  -4.967265 0.270481 -1.732855
H  -3.408469 0.001274 -2.513554
H  -4.82903 -2.518604 -0.114782
H  -4.144541 -1.812544 1.348398
H  -5.461474 -0.99784 0.510336
H  -2.119161 -3.204765 0.350538
H  -0.772686 -4.229086 1.936781
H  -0.161135 -3.131581 3.178712
H  0.888937 -3.630093 1.870572
H  0.080916 -0.181978 0.743521
H  1.275489 -1.144973 1.608176
H  -0.072336 -0.447846 2.480222
H  -1.181071 4.016619 1.426051
H  -1.371695 3.93514 -0.325088
H  0.719056 2.540367 -1.758286
H  1.084448 2.753213 2.544203
H  4.288542 1.495546 -0.640611
H  3.283437 1.507652 -2.080834
H  1.434888 -0.310882 -2.257644
H  4.701586 -0.577626 0.492101
H  1.025955 -2.724261 -2.012847
H  4.291352 -2.995477 0.742248
H  2.452242 -4.081287 -0.507676
elementType: O C H
totalener: -1079.73744628 hartree
nucrepener: 2280.86563982 hartree
electener: -3360.60308610 hartree
oneelecener: -6001.48705190 hartree
twoeener: 2640.88396580 hartree
cpcmener: -0.02783142 hartree
kineticenergy: 1074.85853813 hartree
xcener: -106.464802208914 hartree
chargesum: -0.0000000
charge: -0.293887 -0.499676 -0.278842 0.160204 0.002539 -0.094326 -0.289824 -0.286865 -0.305964 0.385272 -0.017424 -0.225432 -0.212120 0.078669 -0.072375 -0.292515 -0.051807 0.186485 -0.045146 0.055295 -0.213442 -0.198945 -0.141395 -0.128073 -0.211874 0.100317 0.093905 0.094309 0.100497 0.090403 0.099465 0.093031 0.098711 0.121889 0.090972 0.101657 0.091531 0.020593 0.102347 0.125538 0.123903 0.118058 0.160650 0.177506 0.107361 0.116462 0.140874 0.140913 0.159021 0.158326 0.163230
qa: -0.2939 -0.4997 -0.2788 0.1602 0.0025 -0.0943 -0.2898 -0.2869 -0.3060 0.3853 -0.0174 -0.2254 -0.2121 0.0787 -0.0724 -0.2925 -0.0518 0.1865 -0.0451 0.0553 -0.2134 -0.1989 -0.1414 -0.1281 -0.2119 0.1003 0.0939 0.0943 0.1005 0.0904 0.0995 0.0930 0.0987 0.1219 0.0910 0.1017 0.0915 0.0206 0.1023 0.1255 0.1239 0.1181 0.1606 0.1775 0.1074 0.1165 0.1409 0.1409 0.1590 0.1583 0.1632
va: 2.1021 1.9937 2.2523 3.7180 3.7769 3.8170 3.8824 3.9054 3.8534 4.1567 3.7215 3.9248 3.9103 3.8433 3.6382 3.9594 3.9214 3.6457 3.8150 3.5611 3.8672 3.9417 3.8153 3.8449 3.8529 1.0228 1.0315 1.0005 0.9988 1.0211 1.0005 1.0025 1.0027 1.0051 1.0067 0.9961 0.9971 1.0144 1.0011 1.0035 0.9961 1.0085 1.0150 0.9931 1.0138 1.0079 1.0064 1.0044 0.9912 0.9898 0.9889
dispcorr: -0.031324134 hartree
energy: -1079.768770416587
dipole: -10.99914 11.18206 0.18292 -16.49349 16.13650 -0.35699 3.02391 -2.12504 0.89887
magnitude: 0.98431 au
magnitude: 2.50191 debye
