program: Orca
programVersion: 5.0.2
elementType: O O O C C C C C C C C C C C C C C C C C C C C C C H H H H H H H H H H H H H H H H H H H H H H H H H H
charge: 0
multiplicity: 1
keywords: wb97x-d3
keywords: def2-TZVPP
keywords: def2/J RIJCOSX
keywords: DEFGRID2
keywords: scfconv7
keywords: smallprint printgap noloewdin
keywords: NOSOSCF
formula: C22H26O3
InChI: InChI=1/C22H26O3/c1-15(2)10-19-20(22(19,3)4)21(23)25-14-17-12-18(24-13-17)11-16-8-6-5-7-9-16/h5-10,12-13,19-20H,11,14H2,1-4H3
51 atoms
O  -1.766812 2.318578 0.330546
O  -0.87751 1.220902 2.067979
O  1.955632 3.041628 -1.729042
C  -1.621241 -1.118602 0.03556
C  -2.419173 -1.209542 1.304966
C  -2.366122 0.098691 0.56731
C  -0.116007 -1.194938 0.117885
C  -2.178221 -1.733681 -1.223215
C  -3.702086 -1.952972 1.371684
C  -1.596207 1.240355 1.093674
C  -3.848165 -3.186199 1.864301
C  -5.18884 -3.854029 1.903457
C  -2.71549 -4.00344 2.405255
C  -0.892795 3.447863 0.523917
C  0.414718 3.192429 -0.137183
C  1.544384 2.472286 0.371289
C  0.728681 3.512153 -1.414761
C  2.44568 2.40289 -0.635628
C  3.745453 1.691187 -0.770489
C  3.523529 0.232044 -1.094205
C  3.653405 -0.7375 -0.104801
C  3.129505 -0.161153 -2.371152
C  3.398037 -2.074155 -0.383199
C  2.869148 -1.495346 -2.650692
C  3.002239 -2.457085 -1.656808
H  -1.811107 -1.249306 2.204153
H  -3.244942 0.373353 -0.007479
H  0.282556 -0.855985 1.072019
H  0.200228 -2.23151 -0.01279
H  0.354212 -0.607445 -0.674431
H  -1.955337 -2.802393 -1.254903
H  -3.258563 -1.618239 -1.304015
H  -1.727417 -1.276276 -2.105872
H  -4.581467 -1.447721 0.982104
H  -5.467533 -4.115599 2.927482
H  -5.176624 -4.790452 1.339728
H  -5.975469 -3.222144 1.491404
H  -1.753142 -3.496649 2.354784
H  -2.624916 -4.941056 1.85063
H  -2.897797 -4.280348 3.446754
H  -0.78246 3.676263 1.583811
H  -1.40929 4.281173 0.051593
H  1.666473 2.05283 1.356523
H  0.201443 4.055051 -2.183665
H  4.295209 1.78026 0.167044
H  4.352097 2.167021 -1.543583
H  3.956981 -0.444621 0.893244
H  3.025657 0.580625 -3.15442
H  3.505639 -2.815507 0.398054
H  2.563198 -1.785359 -3.647553
H  2.800191 -3.497596 -1.875028
elementType: O C H
totalener: -1079.73871185 hartree
nucrepener: 2180.95303516 hartree
electener: -3260.69174701 hartree
oneelecener: -5801.62053767 hartree
twoeener: 2540.92879066 hartree
cpcmener: -0.02944479 hartree
kineticenergy: 1074.86336974 hartree
xcener: -106.462492878404 hartree
chargesum: -0.0000000
charge: -0.285735 -0.492906 -0.280421 0.202385 -0.014610 -0.139087 -0.337078 -0.275436 -0.271839 0.425628 -0.035033 -0.230308 -0.250659 0.073872 -0.064458 -0.359166 -0.038167 0.239820 -0.042599 0.010803 -0.180323 -0.190433 -0.150169 -0.147417 -0.187324 0.097278 0.095638 0.098586 0.104605 0.090543 0.097592 0.094198 0.098316 0.123041 0.095064 0.094320 0.089998 0.087582 0.096934 0.099248 0.120276 0.120148 0.160638 0.179617 0.106916 0.112262 0.140303 0.140055 0.158768 0.159132 0.159602
qa: -0.2857 -0.4929 -0.2804 0.2024 -0.0146 -0.1391 -0.3371 -0.2754 -0.2718 0.4256 -0.0350 -0.2303 -0.2507 0.0739 -0.0645 -0.3592 -0.0382 0.2398 -0.0426 0.0108 -0.1803 -0.1904 -0.1502 -0.1474 -0.1873 0.0973 0.0956 0.0986 0.1046 0.0905 0.0976 0.0942 0.0983 0.1230 0.0951 0.0943 0.0900 0.0876 0.0969 0.0992 0.1203 0.1201 0.1606 0.1796 0.1069 0.1123 0.1403 0.1401 0.1588 0.1591 0.1596
va: 2.1170 2.0093 2.2697 3.6621 3.8026 3.8889 3.9014 3.8978 3.8653 4.1783 3.7010 3.9264 3.9402 3.8434 3.6570 3.9429 3.9639 3.5825 3.8021 3.6342 3.8767 3.9179 3.8352 3.8748 3.8661 1.0241 1.0369 1.0148 0.9997 0.9953 1.0020 1.0024 1.0028 1.0069 0.9951 0.9961 1.0074 1.0087 0.9974 0.9981 1.0074 0.9971 1.0199 0.9924 1.0104 1.0137 1.0038 1.0116 0.9911 0.9901 0.9908
dispcorr: -0.026840345 hartree
energy: -1079.765552195563
dipole: -14.16560 13.96795 -0.19765 -24.47393 24.12357 -0.35036 3.77146 -4.57796 -0.80650
magnitude: 0.90126 au
magnitude: 2.29081 debye
