program: Orca
programVersion: 5.0.2
elementType: O O O C C C C C C C C C C C C C C C C C C C C C C H H H H H H H H H H H H H H H H H H H H H H H H H H
charge: 0
multiplicity: 1
keywords: wb97x-d3
keywords: def2-TZVPP
keywords: def2/J RIJCOSX
keywords: DEFGRID2
keywords: scfconv7
keywords: smallprint printgap noloewdin
keywords: NOSOSCF
formula: C22H26O3
InChI: InChI=1/C22H26O3/c1-15(2)10-19-20(22(19,3)4)21(23)25-14-17-12-18(24-13-17)11-16-8-6-5-7-9-16/h5-10,12-13,19-20H,11,14H2,1-4H3
51 atoms
O  -2.10501 2.038809 -0.003558
O  -1.440257 1.740933 2.107903
O  1.865344 1.743262 -1.525311
C  -3.937697 -0.403031 0.398855
C  -2.658989 -0.784483 -0.258693
C  -2.628483 -0.00332 1.057989
C  -4.830381 0.623691 -0.255112
C  -4.718348 -1.456373 1.148854
C  -2.110104 -2.157432 -0.313346
C  -2.018208 1.334516 1.120935
C  -0.859756 -2.410926 -0.712727
C  -0.325564 -3.805299 -0.804758
C  0.081881 -1.303002 -1.100074
C  -1.221886 3.163624 -0.179574
C  0.157321 2.67918 -0.457949
C  1.222205 2.449956 0.472779
C  0.612135 2.230639 -1.651693
C  2.231999 1.880091 -0.22384
C  3.550625 1.329308 0.179734
C  3.523668 -0.181041 0.207064
C  2.908784 -0.848758 1.264019
C  4.062803 -0.926058 -0.835699
C  2.839476 -2.233677 1.281402
C  3.994868 -2.314417 -0.821732
C  3.38358 -2.971448 0.236407
H  -2.400802 -0.170421 -1.116771
H  -2.383702 -0.585262 1.93936
H  -4.295968 1.308973 -0.908082
H  -5.580619 0.116227 -0.864258
H  -5.362066 1.212824 0.494355
H  -5.35098 -2.022976 0.463049
H  -4.07684 -2.16434 1.672816
H  -5.369342 -0.991389 1.891139
H  -2.755738 -2.983436 -0.031749
H  0.549798 -3.931587 -0.162323
H  0.008142 -4.028723 -1.821573
H  -1.067294 -4.551326 -0.520359
H  1.093064 -1.674478 -1.265187
H  0.13171 -0.529342 -0.330323
H  -0.235859 -0.810273 -2.022646
H  -1.25653 3.828213 0.683263
H  -1.631552 3.698385 -1.034008
H  1.230374 2.680065 1.526086
H  0.169671 2.196466 -2.635257
H  3.784967 1.718752 1.171351
H  4.334737 1.679145 -0.495842
H  2.47802 -0.27723 2.078276
H  4.543333 -0.418881 -1.66385
H  2.360086 -2.738941 2.109994
H  4.420426 -2.881753 -1.639442
H  3.330273 -4.052299 0.24862
elementType: O C H
totalener: -1079.73577996 hartree
nucrepener: 2249.35872619 hartree
electener: -3329.09450614 hartree
oneelecener: -5938.22486950 hartree
twoeener: 2609.13036336 hartree
cpcmener: -0.02993935 hartree
kineticenergy: 1074.86515324 hartree
xcener: -106.465713215265 hartree
chargesum: -0.0000000
charge: -0.283396 -0.504236 -0.279137 0.154794 -0.006879 -0.074735 -0.269615 -0.297404 -0.333008 0.395934 0.054325 -0.224588 -0.328294 0.063889 -0.073268 -0.280167 -0.046305 0.168660 -0.046416 0.059789 -0.225879 -0.195743 -0.134439 -0.127381 -0.214557 0.098327 0.089278 0.092993 0.093970 0.100676 0.102594 0.088720 0.100088 0.127251 0.091473 0.103090 0.092110 0.089391 0.086499 0.122494 0.121382 0.117996 0.160399 0.177670 0.116257 0.110931 0.142327 0.140863 0.159800 0.158507 0.162969
qa: -0.2834 -0.5042 -0.2791 0.1548 -0.0069 -0.0747 -0.2696 -0.2974 -0.3330 0.3959 0.0543 -0.2246 -0.3283 0.0639 -0.0733 -0.2802 -0.0463 0.1687 -0.0464 0.0598 -0.2259 -0.1957 -0.1344 -0.1274 -0.2146 0.0983 0.0893 0.0930 0.0940 0.1007 0.1026 0.0887 0.1001 0.1273 0.0915 0.1031 0.0921 0.0894 0.0865 0.1225 0.1214 0.1180 0.1604 0.1777 0.1163 0.1109 0.1423 0.1409 0.1598 0.1585 0.1630
va: 2.1018 1.9924 2.2519 3.7568 3.7579 3.8188 3.8713 3.9184 3.8796 4.1533 3.6349 3.9091 3.9881 3.8500 3.6265 3.9810 3.9119 3.6619 3.8042 3.5408 3.8905 3.9445 3.8067 3.8464 3.8643 1.0253 1.0302 1.0147 1.0007 1.0000 0.9987 1.0022 1.0014 1.0065 0.9967 0.9936 1.0105 1.0157 0.9874 1.0000 1.0054 1.0003 1.0155 0.9935 1.0085 1.0098 1.0054 1.0054 0.9893 0.9901 0.9886
dispcorr: -0.029800774 hartree
energy: -1079.765580731323
dipole: -12.44940 12.27367 -0.17573 -15.17074 14.85907 -0.31167 -2.37872 1.25585 -1.12287
magnitude: 1.17850 au
magnitude: 2.99551 debye
