program: Orca
programVersion: 5.0.2
elementType: O O O C C C C C C C C C C C C C C C C C C C C C C H H H H H H H H H H H H H H H H H H H H H H H H H H
charge: 0
multiplicity: 1
keywords: wb97x-d3
keywords: def2-TZVPP
keywords: def2/J RIJCOSX
keywords: DEFGRID2
keywords: scfconv7
keywords: smallprint printgap noloewdin
keywords: NOSOSCF
formula: C22H26O3
InChI: InChI=1/C22H26O3/c1-15(2)10-19-20(22(19,3)4)21(23)25-14-17-12-18(24-13-17)11-16-8-6-5-7-9-16/h5-10,12-13,19-20H,11,14H2,1-4H3
51 atoms
O  -1.074988 0.86546 1.554519
O  -1.048326 -1.296034 0.974895
O  2.545074 2.213015 -0.666989
C  -3.683229 -0.424347 -0.53021
C  -4.006808 -1.222291 0.684804
C  -3.073609 -0.033664 0.811245
C  -2.828044 -1.040523 -1.609478
C  -4.709994 0.543106 -1.067187
C  -5.347137 -1.190176 1.326215
C  -1.648729 -0.251543 1.107826
C  -5.569926 -1.344568 2.633975
C  -6.957419 -1.332645 3.198301
C  -4.476374 -1.536017 3.63867
C  0.323929 0.837247 1.888048
C  1.176075 1.126893 0.705286
C  1.452847 0.298895 -0.433717
C  1.864972 2.273118 0.499547
C  2.284859 1.005961 -1.232271
C  2.978283 0.682179 -2.505742
C  4.422642 0.308128 -2.270384
C  5.406083 1.288062 -2.165262
C  4.78486 -1.026581 -2.11225
C  6.724797 0.94013 -1.904856
C  6.103206 -1.377581 -1.85562
C  7.077545 -0.394028 -1.749314
H  -3.493196 -2.179155 0.74116
H  -3.491773 0.863373 1.253255
H  -2.16707 -1.821836 -1.240607
H  -3.470366 -1.492046 -2.367972
H  -2.216325 -0.285381 -2.106767
H  -5.284172 1.026084 -0.276686
H  -4.226067 1.327721 -1.651317
H  -5.413594 0.029795 -1.725616
H  -6.201792 -1.058796 0.668347
H  -7.7137 -1.179922 2.428722
H  -7.068637 -0.542426 3.945143
H  -7.179895 -2.272622 3.709679
H  -4.48732 -0.729815 4.376822
H  -3.482601 -1.570959 3.195781
H  -4.626752 -2.463373 4.197041
H  0.583477 -0.1160 2.348907
H  0.450063 1.615463 2.638964
H  1.090304 -0.696966 -0.629862
H  1.961483 3.179776 1.076528
H  2.915386 1.529785 -3.192638
H  2.45052 -0.149034 -2.974173
H  5.141825 2.331153 -2.292722
H  4.027982 -1.798125 -2.192618
H  7.47898 1.712638 -1.826893
H  6.369393 -2.420448 -1.740766
H  8.105766 -0.665724 -1.549091
elementType: O C H
totalener: -1079.73975044 hartree
nucrepener: 2054.78596716 hartree
electener: -3134.52571760 hartree
oneelecener: -5549.01503692 hartree
twoeener: 2414.48931932 hartree
cpcmener: -0.02872864 hartree
kineticenergy: 1074.85608197 hartree
xcener: -106.460355968193 hartree
chargesum: 0.0000000
charge: -0.289353 -0.510778 -0.287223 0.158732 -0.027589 -0.105634 -0.282181 -0.290112 -0.295595 0.430744 -0.014954 -0.228148 -0.243306 0.072116 -0.084277 -0.310866 -0.038702 0.209509 -0.057804 0.055097 -0.206079 -0.204668 -0.156682 -0.151983 -0.180588 0.103379 0.094599 0.091816 0.098102 0.099784 0.093651 0.098358 0.099791 0.125313 0.090171 0.094797 0.096053 0.099114 0.080372 0.100661 0.120694 0.117884 0.163071 0.178991 0.117069 0.108340 0.142556 0.144363 0.160151 0.160347 0.160899
qa: -0.2894 -0.5108 -0.2872 0.1587 -0.0276 -0.1056 -0.2822 -0.2901 -0.2956 0.4307 -0.0150 -0.2281 -0.2433 0.0721 -0.0843 -0.3109 -0.0387 0.2095 -0.0578 0.0551 -0.2061 -0.2047 -0.1567 -0.1520 -0.1806 0.1034 0.0946 0.0918 0.0981 0.0998 0.0937 0.0984 0.0998 0.1253 0.0902 0.0948 0.0961 0.0991 0.0804 0.1007 0.1207 0.1179 0.1631 0.1790 0.1171 0.1083 0.1426 0.1444 0.1602 0.1603 0.1609
va: 2.1153 1.9823 2.2692 3.6892 3.8255 3.8223 3.8890 3.9076 3.8849 4.0939 3.7063 3.9291 3.9371 3.8437 3.6747 4.0016 3.9675 3.6527 3.8150 3.5804 3.9546 3.9388 3.8918 3.8835 3.8980 1.0258 1.0314 1.0164 1.0018 0.9998 1.0017 1.0026 0.9994 1.0025 1.0060 0.9964 0.9961 0.9983 1.0154 0.9996 1.0079 0.9990 1.0175 0.9926 1.0084 1.0107 1.0096 1.0031 0.9898 0.9896 0.9894
dispcorr: -0.022797831 hartree
energy: -1079.762548267839
dipole: -28.39153 27.76331 -0.62821 -7.18405 7.84778 0.66373 4.59265 -4.45148 0.14117
magnitude: 0.92472 au
magnitude: 2.35046 debye
