program: Orca
programVersion: 5.0.2
elementType: O O O C C C C C C C C C C C C C C C C C C C C C C H H H H H H H H H H H H H H H H H H H H H H H H H H
charge: 0
multiplicity: 1
keywords: wb97x-d3
keywords: def2-TZVPP
keywords: def2/J RIJCOSX
keywords: DEFGRID2
keywords: scfconv7
keywords: smallprint printgap noloewdin
keywords: NOSOSCF
formula: C22H26O3
InChI: InChI=1/C22H26O3/c1-15(2)10-19-20(22(19,3)4)21(23)25-14-17-12-18(24-13-17)11-16-8-6-5-7-9-16/h5-10,12-13,19-20H,11,14H2,1-4H3
51 atoms
O  -1.56648 1.875562 0.18077
O  -1.800976 0.092586 -1.152182
O  2.883505 1.900054 0.552205
C  -4.538426 -0.133042 0.372116
C  -3.567857 -1.139905 0.909286
C  -3.151019 0.310232 0.81107
C  -4.904532 -0.183677 -1.090691
C  -5.676827 0.320102 1.252698
C  -3.723533 -1.756005 2.248699
C  -2.121582 0.713808 -0.162723
C  -4.085975 -3.021263 2.479312
C  -4.205275 -3.551723 3.8758
C  -4.412739 -4.007782 1.401348
C  -0.528641 2.420788 -0.65377
C  0.814033 1.920648 -0.257818
C  1.367785 0.606437 -0.417589
C  1.781978 2.654394 0.338053
C  2.621268 0.650409 0.08895
C  3.716437 -0.351841 0.154949
C  4.735795 -0.125173 -0.936205
C  5.796385 0.757512 -0.753466
C  4.598255 -0.765076 -2.164772
C  6.698189 0.999853 -1.781299
C  5.49966 -0.527311 -3.192772
C  6.55174 0.359287 -3.00457
H  -3.131828 -1.779626 0.148053
H  -3.129969 0.864133 1.743185
H  -5.829867 -0.7500 -1.211867
H  -5.080404 0.817505 -1.4894
H  -4.149271 -0.666235 -1.706948
H  -6.496753 -0.400004 1.209913
H  -5.38452 0.427681 2.296932
H  -6.064675 1.282896 0.915158
H  -3.529672 -1.115635 3.104308
H  -3.95596 -2.800676 4.62491
H  -3.546719 -4.410818 4.026353
H  -5.220419 -3.904478 4.07473
H  -4.323898 -3.600131 0.396248
H  -5.435608 -4.374005 1.520124
H  -3.764573 -4.885096 1.467768
H  -0.585496 3.49893 -0.507121
H  -0.741157 2.216678 -1.70395
H  0.900028 -0.257972 -0.85957
H  1.826129 3.684469 0.656071
H  3.272262 -1.342144 0.048489
H  4.197319 -0.319621 1.135666
H  5.922224 1.257026 0.199862
H  3.777403 -1.455754 -2.318329
H  7.518598 1.688362 -1.624949
H  5.380131 -1.035109 -4.141172
H  7.25584 0.546446 -3.804765
elementType: O C H
totalener: -1079.74037898 hartree
nucrepener: 2035.81865689 hartree
electener: -3115.55903587 hartree
oneelecener: -5511.14394322 hartree
twoeener: 2395.58490736 hartree
cpcmener: -0.02953766 hartree
kineticenergy: 1074.85337264 hartree
xcener: -106.459701044214 hartree
chargesum: -0.0000000
charge: -0.289815 -0.510807 -0.287042 0.151796 0.003550 -0.128074 -0.298277 -0.266948 -0.279471 0.445904 -0.032411 -0.228398 -0.251855 0.077155 -0.094019 -0.297948 -0.038359 0.200146 -0.059346 0.058672 -0.206605 -0.206809 -0.155938 -0.152245 -0.180596 0.096496 0.090917 0.096166 0.103172 0.092464 0.095952 0.090855 0.098469 0.124775 0.089586 0.094934 0.094347 0.088635 0.096811 0.097538 0.120145 0.118975 0.163345 0.179099 0.110045 0.116125 0.142916 0.144689 0.159673 0.160465 0.161145
qa: -0.2898 -0.5108 -0.2870 0.1518 0.0036 -0.1281 -0.2983 -0.2669 -0.2795 0.4459 -0.0324 -0.2284 -0.2519 0.0772 -0.0940 -0.2979 -0.0384 0.2001 -0.0593 0.0587 -0.2066 -0.2068 -0.1559 -0.1522 -0.1806 0.0965 0.0909 0.0962 0.1032 0.0925 0.0960 0.0909 0.0985 0.1248 0.0896 0.0949 0.0943 0.0886 0.0968 0.0975 0.1201 0.1190 0.1633 0.1791 0.1100 0.1161 0.1429 0.1447 0.1597 0.1605 0.1611
va: 2.1230 1.9841 2.2683 3.6517 3.7689 3.9162 3.9019 3.9084 3.8736 4.1048 3.7083 3.9251 3.9441 3.8330 3.6911 4.0136 3.9652 3.6672 3.8181 3.5760 3.9551 3.9405 3.8901 3.8853 3.8976 1.0266 1.0380 1.0008 0.9983 1.0181 1.0028 1.0027 1.0025 1.0067 1.0078 0.9956 0.9961 1.0082 0.9971 0.9979 0.9995 1.0097 1.0175 0.9924 1.0101 1.0089 1.0084 1.0030 0.9900 0.9895 0.9893
dispcorr: -0.021953110 hartree
energy: -1079.762332086941
dipole: -28.51926 27.93860 -0.58065 -15.62304 15.72854 0.10550 7.99326 -7.29247 0.70079
magnitude: 0.91619 au
magnitude: 2.32876 debye
