program: Orca
programVersion: 5.0.2
elementType: O O O C C C C C C C C C C C C C C C C C C C C C C H H H H H H H H H H H H H H H H H H H H H H H H H H
charge: 0
multiplicity: 1
keywords: wb97x-d3
keywords: def2-TZVPP
keywords: def2/J RIJCOSX
keywords: DEFGRID2
keywords: scfconv7
keywords: smallprint printgap noloewdin
keywords: NOSOSCF
formula: C22H26O3
InChI: InChI=1/C22H26O3/c1-15(2)10-19-20(22(19,3)4)21(23)25-14-17-12-18(24-13-17)11-16-8-6-5-7-9-16/h5-10,12-13,19-20H,11,14H2,1-4H3
51 atoms
O  -1.65482 1.858694 0.154695
O  -1.96932 0.105767 -1.201749
O  2.806493 1.795757 0.414208
C  -4.693486 -0.030491 0.381327
C  -3.758712 -1.102401 0.853488
C  -3.275486 0.334505 0.790608
C  -5.100744 -0.023928 -1.071702
C  -5.787208 0.464498 1.296803
C  -3.892688 -1.756195 2.170263
C  -2.251985 0.720383 -0.19658
C  -3.825059 -3.068901 2.416931
C  -3.966389 -3.593625 3.814663
C  -3.60341 -4.126536 1.379062
C  -0.624568 2.393079 -0.695904
C  0.717771 1.860805 -0.342205
C  1.247494 0.54161 -0.53911
C  1.711871 2.569465 0.241197
C  2.512738 0.557314 -0.060653
C  3.58465 -0.469674 -0.001564
C  4.717931 -0.156778 -0.948526
C  5.827364 0.565715 -0.519979
C  4.650888 -0.558392 -2.280094
C  6.850496 0.881677 -1.404732
C  5.672984 -0.247161 -3.165526
C  6.776479 0.476152 -2.730241
H  -3.374757 -1.728068 0.05506
H  -3.201363 0.855957 1.738526
H  -6.038161 -0.571157 -1.186755
H  -5.270976 0.993945 -1.427916
H  -4.370658 -0.494482 -1.726177
H  -6.644207 -0.211185 1.26463
H  -5.46888 0.549657 2.334784
H  -6.132293 1.44949 0.977494
H  -4.056735 -1.094089 3.015612
H  -3.085062 -4.17085 4.106572
H  -4.818807 -4.273123 3.893994
H  -4.102434 -2.795215 4.543804
H  -2.654856 -4.641979 1.552607
H  -3.594601 -3.750401 0.357968
H  -4.382199 -4.890618 1.442008
H  -0.653909 3.468884 -0.530495
H  -0.866847 2.210784 -1.743016
H  0.754487 -0.307793 -0.983273
H  1.780128 3.594499 0.5714
H  3.136982 -1.430999 -0.256377
H  3.964668 -0.555251 1.01985
H  5.895803 0.879396 0.514903
H  3.792507 -1.123159 -2.625155
H  7.707682 1.443681 -1.056776
H  5.609449 -0.572374 -4.19601
H  7.574752 0.718605 -3.419528
elementType: O C H
totalener: -1079.74150552 hartree
nucrepener: 2033.26746017 hartree
electener: -3113.00896570 hartree
oneelecener: -5506.01436303 hartree
twoeener: 2393.00539734 hartree
cpcmener: -0.03008160 hartree
kineticenergy: 1074.84366434 hartree
xcener: -106.458836959791 hartree
chargesum: 0.0000000
charge: -0.289124 -0.511680 -0.287647 0.102764 0.045726 -0.100989 -0.279534 -0.270613 -0.287175 0.440920 -0.045826 -0.219237 -0.255603 0.073912 -0.094276 -0.294555 -0.035066 0.188370 -0.052331 0.056901 -0.200416 -0.207940 -0.159726 -0.155637 -0.178189 0.090024 0.090502 0.097089 0.100421 0.091446 0.097432 0.089499 0.097414 0.121936 0.093187 0.094120 0.089004 0.098741 0.091195 0.094755 0.120265 0.119000 0.162455 0.178773 0.113348 0.114967 0.143327 0.145703 0.160382 0.160702 0.161286
qa: -0.2891 -0.5117 -0.2876 0.1028 0.0457 -0.1010 -0.2795 -0.2706 -0.2872 0.4409 -0.0458 -0.2192 -0.2556 0.0739 -0.0943 -0.2946 -0.0351 0.1884 -0.0523 0.0569 -0.2004 -0.2079 -0.1597 -0.1556 -0.1782 0.0900 0.0905 0.0971 0.1004 0.0914 0.0974 0.0895 0.0974 0.1219 0.0932 0.0941 0.0890 0.0987 0.0912 0.0948 0.1203 0.1190 0.1625 0.1788 0.1133 0.1150 0.1433 0.1457 0.1604 0.1607 0.1613
va: 2.1215 1.9833 2.2700 3.6870 3.7620 3.8542 3.9034 3.9114 3.8767 4.1097 3.7523 3.9200 3.9416 3.8371 3.6855 4.0160 3.9651 3.6807 3.8127 3.5724 3.9511 3.9410 3.8909 3.8880 3.8956 1.0348 1.0358 1.0001 0.9990 1.0186 1.0017 1.0059 1.0018 1.0101 0.9959 0.9964 1.0086 0.9961 1.0090 0.9975 0.9995 1.0099 1.0173 0.9925 1.0086 1.0060 1.0064 1.0026 0.9898 0.9897 0.9894
dispcorr: -0.021496670 hartree
energy: -1079.763002191896
dipole: -26.75904 26.30362 -0.45541 -15.25178 15.38051 0.12873 8.38175 -7.66164 0.72011
magnitude: 0.86170 au
magnitude: 2.19027 debye
