program: Orca
programVersion: 5.0.2
elementType: O O O C C C C C C C C C C C C C C C C C C C C C C H H H H H H H H H H H H H H H H H H H H H H H H H H
charge: 0
multiplicity: 1
keywords: wb97x-d3
keywords: def2-TZVPP
keywords: def2/J RIJCOSX
keywords: DEFGRID2
keywords: scfconv7
keywords: smallprint printgap noloewdin
keywords: NOSOSCF
formula: C22H26O3
InChI: InChI=1/C22H26O3/c1-15(2)10-19-20(22(19,3)4)21(23)25-14-17-12-18(24-13-17)11-16-8-6-5-7-9-16/h5-10,12-13,19-20H,11,14H2,1-4H3
51 atoms
O  -1.709562 2.05572 0.004262
O  -1.043616 1.144315 1.935531
O  2.65576 2.538345 0.329405
C  -1.211998 -1.405768 0.050567
C  -2.22774 -1.452775 1.142109
C  -2.126627 -0.208426 0.287329
C  0.251839 -1.327293 0.413572
C  -1.45677 -2.16366 -1.230896
C  -3.438444 -2.310546 1.080589
C  -1.575872 1.033693 0.853468
C  -4.521586 -2.148483 1.845303
C  -5.688271 -3.083058 1.756339
C  -4.668983 -1.040504 2.842021
C  -0.938206 3.241499 0.267935
C  0.498801 2.956602 0.017732
C  1.069696 2.505684 -1.216499
C  1.508167 2.949619 0.917191
C  2.376814 2.258988 -0.970272
C  3.456919 1.656764 -1.7961
C  3.439219 0.15061 -1.674211
C  2.790377 -0.623626 -2.631814
C  4.012764 -0.483098 -0.574576
C  2.716441 -2.003982 -2.497009
C  3.940272 -1.86288 -0.437232
C  3.291872 -2.627923 -1.398423
H  -1.81313 -1.323592 2.138397
H  -2.889918 -0.065723 -0.469735
H  0.430984 -0.883436 1.391235
H  0.676124 -2.333202 0.43401
H  0.808477 -0.748903 -0.327942
H  -2.500793 -2.142477 -1.542643
H  -0.861411 -1.738844 -2.041705
H  -1.160608 -3.20908 -1.12125
H  -3.42473 -3.138798 0.378045
H  -6.604654 -2.543508 1.50335
H  -5.874142 -3.569225 2.717738
H  -5.536862 -3.86184 1.009013
H  -5.553193 -0.438133 2.61499
H  -3.810239 -0.370522 2.875262
H  -4.822959 -1.441786 3.84793
H  -1.108269 3.609521 1.280647
H  -1.32939 3.981252 -0.428958
H  0.562821 2.368772 -2.159227
H  1.559944 3.206991 1.963632
H  4.428353 2.054852 -1.495359
H  3.301127 1.94546 -2.836079
H  2.338306 -0.142431 -3.491266
H  4.522003 0.105315 0.179742
H  2.210914 -2.59173 -3.252573
H  4.392588 -2.341467 0.421958
H  3.235896 -3.703438 -1.291246
elementType: O C H
totalener: -1079.73847030 hartree
nucrepener: 2196.79688972 hartree
electener: -3276.53536002 hartree
oneelecener: -5833.42696282 hartree
twoeener: 2556.89160280 hartree
cpcmener: -0.02987926 hartree
kineticenergy: 1074.85025429 hartree
xcener: -106.461373639624 hartree
chargesum: 0.0000000
charge: -0.291424 -0.494146 -0.282056 0.219553 -0.056565 -0.080596 -0.276256 -0.311540 -0.283929 0.384604 -0.016240 -0.231850 -0.247315 0.096944 -0.057955 -0.360742 -0.035562 0.218864 -0.050782 0.031896 -0.170533 -0.194621 -0.164916 -0.151854 -0.185237 0.101332 0.094133 0.101708 0.107013 0.049761 0.095609 0.095196 0.103706 0.126849 0.094719 0.095522 0.089726 0.097549 0.078896 0.099498 0.118546 0.122382 0.159989 0.179012 0.113217 0.108389 0.140670 0.140846 0.159604 0.158553 0.159834
qa: -0.2914 -0.4941 -0.2821 0.2196 -0.0566 -0.0806 -0.2763 -0.3115 -0.2839 0.3846 -0.0162 -0.2318 -0.2473 0.0969 -0.0580 -0.3607 -0.0356 0.2189 -0.0508 0.0319 -0.1705 -0.1946 -0.1649 -0.1519 -0.1852 0.1013 0.0941 0.1017 0.1070 0.0498 0.0956 0.0952 0.1037 0.1268 0.0947 0.0955 0.0897 0.0975 0.0789 0.0995 0.1185 0.1224 0.1600 0.1790 0.1132 0.1084 0.1407 0.1408 0.1596 0.1586 0.1598
va: 2.1052 1.9953 2.2618 3.6488 3.8557 3.8146 3.8792 3.9137 3.8851 4.1634 3.7093 3.9289 3.9395 3.8335 3.6252 3.9573 3.9519 3.6002 3.8113 3.6109 3.8728 3.9218 3.8467 3.8703 3.8482 1.0238 1.0326 1.0221 0.9982 1.0103 1.0028 1.0033 0.9976 1.0020 0.9964 0.9956 1.0065 0.9980 1.0183 0.9986 1.0075 0.9919 1.0113 0.9953 1.0131 1.0110 1.0033 1.0102 0.9903 0.9906 0.9909
dispcorr: -0.027445132 hartree
energy: -1079.765915427549
dipole: -17.47775 17.09054 -0.38721 -18.06647 17.93728 -0.12919 1.96171 -3.16854 -1.20683
magnitude: 1.27399 au
magnitude: 3.23823 debye
